Class com.owncloud.android.lib.resources.users.DeleteE2ERemoteOperationIT

3

tests

3

failures

0

skipped

19.706s

duration

0%

successful

Failed tests

testDeleteEncryptedFiles

org.junit.AssumptionViolatedException: got: <false>, expected: is <true>
	at org.junit.Assume.assumeThat(Assume.java:106)
	at org.junit.Assume.assumeTrue(Assume.java:50)
	at com.owncloud.android.AbstractIT.testOnlyOnServer(AbstractIT.java:350)
	at com.owncloud.android.lib.resources.users.DeleteE2ERemoteOperationIT.before(DeleteE2ERemoteOperationIT.kt:20)

testDeletePrivateKey

org.junit.AssumptionViolatedException: got: <false>, expected: is <true>
	at org.junit.Assume.assumeThat(Assume.java:106)
	at org.junit.Assume.assumeTrue(Assume.java:50)
	at com.owncloud.android.AbstractIT.testOnlyOnServer(AbstractIT.java:350)
	at com.owncloud.android.lib.resources.users.DeleteE2ERemoteOperationIT.before(DeleteE2ERemoteOperationIT.kt:20)

testDeletePublicKey

org.junit.AssumptionViolatedException: got: <false>, expected: is <true>
	at org.junit.Assume.assumeThat(Assume.java:106)
	at org.junit.Assume.assumeTrue(Assume.java:50)
	at com.owncloud.android.AbstractIT.testOnlyOnServer(AbstractIT.java:350)
	at com.owncloud.android.lib.resources.users.DeleteE2ERemoteOperationIT.before(DeleteE2ERemoteOperationIT.kt:20)

Tests

Test emulator-5554
testDeleteEncryptedFiles failed (6.528s)
testDeletePrivateKey failed (6.596s)
testDeletePublicKey failed (6.582s)