Class com.owncloud.android.lib.resources.assistant.v2.AssistantV2Tests

3

tests

3

failures

0

skipped

16.000s

duration

0%

successful

Failed tests

testDeleteTask

org.junit.AssumptionViolatedException: got: <false>, expected: is <true>
	at org.junit.Assume.assumeThat(Assume.java:106)
	at org.junit.Assume.assumeTrue(Assume.java:50)
	at com.owncloud.android.AbstractIT.testOnlyOnServer(AbstractIT.java:350)
	at com.owncloud.android.lib.resources.assistant.v2.AssistantV2Tests.before(AssistantV2Tests.kt:23)

testGetTaskList

org.junit.AssumptionViolatedException: got: <false>, expected: is <true>
	at org.junit.Assume.assumeThat(Assume.java:106)
	at org.junit.Assume.assumeTrue(Assume.java:50)
	at com.owncloud.android.AbstractIT.testOnlyOnServer(AbstractIT.java:350)
	at com.owncloud.android.lib.resources.assistant.v2.AssistantV2Tests.before(AssistantV2Tests.kt:23)

testGetTaskTypes

org.junit.AssumptionViolatedException: got: <false>, expected: is <true>
	at org.junit.Assume.assumeThat(Assume.java:106)
	at org.junit.Assume.assumeTrue(Assume.java:50)
	at com.owncloud.android.AbstractIT.testOnlyOnServer(AbstractIT.java:350)
	at com.owncloud.android.lib.resources.assistant.v2.AssistantV2Tests.before(AssistantV2Tests.kt:23)

Tests

Test emulator-5554
testDeleteTask failed (5.288s)
testGetTaskList failed (5.482s)
testGetTaskTypes failed (5.230s)