Class com.owncloud.android.lib.resources.assistant.v1.AssistantV1Tests

3

tests

3

failures

0

skipped

16.013s

duration

0%

successful

Failed tests

testDeleteTask

org.junit.AssumptionViolatedException: got: <false>, expected: is <true>
	at org.junit.Assume.assumeThat(Assume.java:106)
	at org.junit.Assume.assumeTrue(Assume.java:50)
	at com.owncloud.android.AbstractIT.testOnlyOnServer(AbstractIT.java:350)
	at com.owncloud.android.lib.resources.assistant.v1.AssistantV1Tests.before(AssistantV1Tests.kt:21)

testGetTaskList

org.junit.AssumptionViolatedException: got: <false>, expected: is <true>
	at org.junit.Assume.assumeThat(Assume.java:106)
	at org.junit.Assume.assumeTrue(Assume.java:50)
	at com.owncloud.android.AbstractIT.testOnlyOnServer(AbstractIT.java:350)
	at com.owncloud.android.lib.resources.assistant.v1.AssistantV1Tests.before(AssistantV1Tests.kt:21)

testGetTaskTypes

org.junit.AssumptionViolatedException: got: <false>, expected: is <true>
	at org.junit.Assume.assumeThat(Assume.java:106)
	at org.junit.Assume.assumeTrue(Assume.java:50)
	at com.owncloud.android.AbstractIT.testOnlyOnServer(AbstractIT.java:350)
	at com.owncloud.android.lib.resources.assistant.v1.AssistantV1Tests.before(AssistantV1Tests.kt:21)

Tests

Test emulator-5554
testDeleteTask failed (5.452s)
testGetTaskList failed (5.221s)
testGetTaskTypes failed (5.340s)