Class com.owncloud.android.EncryptedFoldersIT
|
0%
successful |
Failed tests
testCreateEncryptedFolder
java.lang.AssertionError at org.junit.Assert.fail(Assert.java:87) at org.junit.Assert.assertTrue(Assert.java:42) at org.junit.Assert.assertTrue(Assert.java:53) at com.owncloud.android.EncryptedFoldersIT.encryptionCleanup(EncryptedFoldersIT.kt:153)
testCreateEncryptedSubfolder
java.lang.AssertionError at org.junit.Assert.fail(Assert.java:87) at org.junit.Assert.assertTrue(Assert.java:42) at org.junit.Assert.assertTrue(Assert.java:53) at com.owncloud.android.EncryptedFoldersIT.encryptionCleanup(EncryptedFoldersIT.kt:153)
testReadEncryptedFolder
java.lang.AssertionError at org.junit.Assert.fail(Assert.java:87) at org.junit.Assert.assertTrue(Assert.java:42) at org.junit.Assert.assertTrue(Assert.java:53) at com.owncloud.android.EncryptedFoldersIT.encryptionCleanup(EncryptedFoldersIT.kt:153)
Tests
| Test | emulator-5554 |
|---|---|
| testCreateEncryptedFolder | failed (2.765s) |
| testCreateEncryptedSubfolder | failed (2.813s) |
| testReadEncryptedFolder | failed (2.737s) |
| testReadEncryptedSubfolder | failed (2.759s) |
| testUnencryptFolder | failed (2.777s) |