Class com.nextcloud.utils.AutoRenameTests
|
0%
successful |
Failed tests
testE2EEFile
org.junit.AssumptionViolatedException: got: <false>, expected: is <true> at org.junit.Assume.assumeThat(Assume.java:106) at org.junit.Assume.assumeTrue(Assume.java:50) at com.owncloud.android.AbstractIT.testOnlyOnServer(AbstractIT.java:205) at com.nextcloud.utils.AutoRenameTests.setup(AutoRenameTests.kt:30)
testEndInvalidExtension
org.junit.AssumptionViolatedException: got: <false>, expected: is <true> at org.junit.Assume.assumeThat(Assume.java:106) at org.junit.Assume.assumeTrue(Assume.java:50) at com.owncloud.android.AbstractIT.testOnlyOnServer(AbstractIT.java:205) at com.nextcloud.utils.AutoRenameTests.setup(AutoRenameTests.kt:30)
testEndInvalidFolderChar
org.junit.AssumptionViolatedException: got: <false>, expected: is <true> at org.junit.Assume.assumeThat(Assume.java:106) at org.junit.Assume.assumeTrue(Assume.java:50) at com.owncloud.android.AbstractIT.testOnlyOnServer(AbstractIT.java:205) at com.nextcloud.utils.AutoRenameTests.setup(AutoRenameTests.kt:30)
testEndNonPrintableChar
org.junit.AssumptionViolatedException: got: <false>, expected: is <true> at org.junit.Assume.assumeThat(Assume.java:106) at org.junit.Assume.assumeTrue(Assume.java:50) at com.owncloud.android.AbstractIT.testOnlyOnServer(AbstractIT.java:205) at com.nextcloud.utils.AutoRenameTests.setup(AutoRenameTests.kt:30)
testExtensionNonPrintableChar
org.junit.AssumptionViolatedException: got: <false>, expected: is <true> at org.junit.Assume.assumeThat(Assume.java:106) at org.junit.Assume.assumeTrue(Assume.java:50) at com.owncloud.android.AbstractIT.testOnlyOnServer(AbstractIT.java:205) at com.nextcloud.utils.AutoRenameTests.setup(AutoRenameTests.kt:30)
testFolderNameLowercase
org.junit.AssumptionViolatedException: got: <false>, expected: is <true> at org.junit.Assume.assumeThat(Assume.java:106) at org.junit.Assume.assumeTrue(Assume.java:50) at com.owncloud.android.AbstractIT.testOnlyOnServer(AbstractIT.java:205) at com.nextcloud.utils.AutoRenameTests.setup(AutoRenameTests.kt:30)
testInvalidChar
org.junit.AssumptionViolatedException: got: <false>, expected: is <true> at org.junit.Assume.assumeThat(Assume.java:106) at org.junit.Assume.assumeTrue(Assume.java:50) at com.owncloud.android.AbstractIT.testOnlyOnServer(AbstractIT.java:205) at com.nextcloud.utils.AutoRenameTests.setup(AutoRenameTests.kt:30)
testInvalidExtension
org.junit.AssumptionViolatedException: got: <false>, expected: is <true> at org.junit.Assume.assumeThat(Assume.java:106) at org.junit.Assume.assumeTrue(Assume.java:50) at com.owncloud.android.AbstractIT.testOnlyOnServer(AbstractIT.java:205) at com.nextcloud.utils.AutoRenameTests.setup(AutoRenameTests.kt:30)
testMiddleInvalidFolderChar
org.junit.AssumptionViolatedException: got: <false>, expected: is <true> at org.junit.Assume.assumeThat(Assume.java:106) at org.junit.Assume.assumeTrue(Assume.java:50) at com.owncloud.android.AbstractIT.testOnlyOnServer(AbstractIT.java:205) at com.nextcloud.utils.AutoRenameTests.setup(AutoRenameTests.kt:30)
testMiddleNonPrintableChar
org.junit.AssumptionViolatedException: got: <false>, expected: is <true> at org.junit.Assume.assumeThat(Assume.java:106) at org.junit.Assume.assumeTrue(Assume.java:50) at com.owncloud.android.AbstractIT.testOnlyOnServer(AbstractIT.java:205) at com.nextcloud.utils.AutoRenameTests.setup(AutoRenameTests.kt:30)
testMixedInvalidChar
org.junit.AssumptionViolatedException: got: <false>, expected: is <true> at org.junit.Assume.assumeThat(Assume.java:106) at org.junit.Assume.assumeTrue(Assume.java:50) at com.owncloud.android.AbstractIT.testOnlyOnServer(AbstractIT.java:205) at com.nextcloud.utils.AutoRenameTests.setup(AutoRenameTests.kt:30)
testMultipleInvalidChars
org.junit.AssumptionViolatedException: got: <false>, expected: is <true> at org.junit.Assume.assumeThat(Assume.java:106) at org.junit.Assume.assumeTrue(Assume.java:50) at com.owncloud.android.AbstractIT.testOnlyOnServer(AbstractIT.java:205) at com.nextcloud.utils.AutoRenameTests.setup(AutoRenameTests.kt:30)
testRemovingLeadingWhitespace
org.junit.AssumptionViolatedException: got: <false>, expected: is <true> at org.junit.Assume.assumeThat(Assume.java:106) at org.junit.Assume.assumeTrue(Assume.java:50) at com.owncloud.android.AbstractIT.testOnlyOnServer(AbstractIT.java:205) at com.nextcloud.utils.AutoRenameTests.setup(AutoRenameTests.kt:30)
testRemovingTrailingAndLeadingWhitespace
org.junit.AssumptionViolatedException: got: <false>, expected: is <true> at org.junit.Assume.assumeThat(Assume.java:106) at org.junit.Assume.assumeTrue(Assume.java:50) at com.owncloud.android.AbstractIT.testOnlyOnServer(AbstractIT.java:205) at com.nextcloud.utils.AutoRenameTests.setup(AutoRenameTests.kt:30)
testRemovingTrailingWhitespace
org.junit.AssumptionViolatedException: got: <false>, expected: is <true> at org.junit.Assume.assumeThat(Assume.java:106) at org.junit.Assume.assumeTrue(Assume.java:50) at com.owncloud.android.AbstractIT.testOnlyOnServer(AbstractIT.java:205) at com.nextcloud.utils.AutoRenameTests.setup(AutoRenameTests.kt:30)
testRenameExtensionForFile
org.junit.AssumptionViolatedException: got: <false>, expected: is <true> at org.junit.Assume.assumeThat(Assume.java:106) at org.junit.Assume.assumeTrue(Assume.java:50) at com.owncloud.android.AbstractIT.testOnlyOnServer(AbstractIT.java:205) at com.nextcloud.utils.AutoRenameTests.setup(AutoRenameTests.kt:30)
testRenameExtensionForFolder
org.junit.AssumptionViolatedException: got: <false>, expected: is <true> at org.junit.Assume.assumeThat(Assume.java:106) at org.junit.Assume.assumeTrue(Assume.java:50) at com.owncloud.android.AbstractIT.testOnlyOnServer(AbstractIT.java:205) at com.nextcloud.utils.AutoRenameTests.setup(AutoRenameTests.kt:30)
testRenameWithLowercasedFiles
org.junit.AssumptionViolatedException: got: <false>, expected: is <true> at org.junit.Assume.assumeThat(Assume.java:106) at org.junit.Assume.assumeTrue(Assume.java:50) at com.owncloud.android.AbstractIT.testOnlyOnServer(AbstractIT.java:205) at com.nextcloud.utils.AutoRenameTests.setup(AutoRenameTests.kt:30)
testStartEndInvalidExtensions
org.junit.AssumptionViolatedException: got: <false>, expected: is <true> at org.junit.Assume.assumeThat(Assume.java:106) at org.junit.Assume.assumeTrue(Assume.java:50) at com.owncloud.android.AbstractIT.testOnlyOnServer(AbstractIT.java:205) at com.nextcloud.utils.AutoRenameTests.setup(AutoRenameTests.kt:30)
testStartInvalidExtension
org.junit.AssumptionViolatedException: got: <false>, expected: is <true> at org.junit.Assume.assumeThat(Assume.java:106) at org.junit.Assume.assumeTrue(Assume.java:50) at com.owncloud.android.AbstractIT.testOnlyOnServer(AbstractIT.java:205) at com.nextcloud.utils.AutoRenameTests.setup(AutoRenameTests.kt:30)
testStartInvalidFolderChar
org.junit.AssumptionViolatedException: got: <false>, expected: is <true> at org.junit.Assume.assumeThat(Assume.java:106) at org.junit.Assume.assumeTrue(Assume.java:50) at com.owncloud.android.AbstractIT.testOnlyOnServer(AbstractIT.java:205) at com.nextcloud.utils.AutoRenameTests.setup(AutoRenameTests.kt:30)
testStartNonPrintableChar
org.junit.AssumptionViolatedException: got: <false>, expected: is <true> at org.junit.Assume.assumeThat(Assume.java:106) at org.junit.Assume.assumeTrue(Assume.java:50) at com.owncloud.android.AbstractIT.testOnlyOnServer(AbstractIT.java:205) at com.nextcloud.utils.AutoRenameTests.setup(AutoRenameTests.kt:30)
testStartsWithPathSeparator
org.junit.AssumptionViolatedException: got: <false>, expected: is <true> at org.junit.Assume.assumeThat(Assume.java:106) at org.junit.Assume.assumeTrue(Assume.java:50) at com.owncloud.android.AbstractIT.testOnlyOnServer(AbstractIT.java:205) at com.nextcloud.utils.AutoRenameTests.setup(AutoRenameTests.kt:30)
testStartsWithPathSeparatorAndValidFilepath
org.junit.AssumptionViolatedException: got: <false>, expected: is <true> at org.junit.Assume.assumeThat(Assume.java:106) at org.junit.Assume.assumeTrue(Assume.java:50) at com.owncloud.android.AbstractIT.testOnlyOnServer(AbstractIT.java:205) at com.nextcloud.utils.AutoRenameTests.setup(AutoRenameTests.kt:30)
testValidFilename
org.junit.AssumptionViolatedException: got: <false>, expected: is <true> at org.junit.Assume.assumeThat(Assume.java:106) at org.junit.Assume.assumeTrue(Assume.java:50) at com.owncloud.android.AbstractIT.testOnlyOnServer(AbstractIT.java:205) at com.nextcloud.utils.AutoRenameTests.setup(AutoRenameTests.kt:30)
testWCFDisabledOnNextcloud30to31ShouldStillApplyRestrictions
org.junit.AssumptionViolatedException: got: <false>, expected: is <true> at org.junit.Assume.assumeThat(Assume.java:106) at org.junit.Assume.assumeTrue(Assume.java:50) at com.owncloud.android.AbstractIT.testOnlyOnServer(AbstractIT.java:205) at com.nextcloud.utils.AutoRenameTests.setup(AutoRenameTests.kt:30)
testWCFDisabledOnNextcloud32ShouldSkipRestrictions
org.junit.AssumptionViolatedException: got: <false>, expected: is <true> at org.junit.Assume.assumeThat(Assume.java:106) at org.junit.Assume.assumeTrue(Assume.java:50) at com.owncloud.android.AbstractIT.testOnlyOnServer(AbstractIT.java:205) at com.nextcloud.utils.AutoRenameTests.setup(AutoRenameTests.kt:30)
testWCFEnabledOnNextcloud32ShouldApplyRestrictions
org.junit.AssumptionViolatedException: got: <false>, expected: is <true> at org.junit.Assume.assumeThat(Assume.java:106) at org.junit.Assume.assumeTrue(Assume.java:50) at com.owncloud.android.AbstractIT.testOnlyOnServer(AbstractIT.java:205) at com.nextcloud.utils.AutoRenameTests.setup(AutoRenameTests.kt:30)
testWCFOnNextcloudBelow30ShouldSkipRestrictions
org.junit.AssumptionViolatedException: got: <false>, expected: is <true> at org.junit.Assume.assumeThat(Assume.java:106) at org.junit.Assume.assumeTrue(Assume.java:50) at com.owncloud.android.AbstractIT.testOnlyOnServer(AbstractIT.java:205) at com.nextcloud.utils.AutoRenameTests.setup(AutoRenameTests.kt:30)
Tests
| Test | emulator-5554 |
|---|---|
| testE2EEFile | failed (0.950s) |
| testEndInvalidExtension | failed (0.576s) |
| testEndInvalidFolderChar | failed (0.914s) |
| testEndNonPrintableChar | failed (1.496s) |
| testExtensionNonPrintableChar | failed (0.747s) |
| testFolderNameLowercase | failed (1.355s) |
| testInvalidChar | failed (0.472s) |
| testInvalidExtension | failed (0.977s) |
| testMiddleInvalidFolderChar | failed (0.617s) |
| testMiddleNonPrintableChar | failed (0.523s) |
| testMixedInvalidChar | failed (0.615s) |
| testMultipleInvalidChars | failed (0.492s) |
| testRemovingLeadingWhitespace | failed (0.924s) |
| testRemovingTrailingAndLeadingWhitespace | failed (0.523s) |
| testRemovingTrailingWhitespace | failed (1.027s) |
| testRenameExtensionForFile | failed (1.219s) |
| testRenameExtensionForFolder | failed (0.518s) |
| testRenameWithLowercasedFiles | failed (0.820s) |
| testStartEndInvalidExtensions | failed (0.721s) |
| testStartInvalidExtension | failed (0.593s) |
| testStartInvalidFolderChar | failed (0.596s) |
| testStartNonPrintableChar | failed (0.767s) |
| testStartsWithPathSeparator | failed (1.542s) |
| testStartsWithPathSeparatorAndValidFilepath | failed (0.476s) |
| testValidFilename | failed (0.683s) |
| testWCFDisabledOnNextcloud30to31ShouldStillApplyRestrictions | failed (0.618s) |
| testWCFDisabledOnNextcloud32ShouldSkipRestrictions | failed (0.617s) |
| testWCFEnabledOnNextcloud32ShouldApplyRestrictions | failed (0.609s) |
| testWCFOnNextcloudBelow30ShouldSkipRestrictions | failed (0.952s) |