Class com.nextcloud.utils.AutoRenameTests
|
0%
successful |
Failed tests
testE2EEFile
org.junit.AssumptionViolatedException: got: <false>, expected: is <true> at org.junit.Assume.assumeThat(Assume.java:106) at org.junit.Assume.assumeTrue(Assume.java:50) at com.owncloud.android.AbstractIT.testOnlyOnServer(AbstractIT.java:205) at com.nextcloud.utils.AutoRenameTests.setup(AutoRenameTests.kt:30)
testEndInvalidExtension
org.junit.AssumptionViolatedException: got: <false>, expected: is <true> at org.junit.Assume.assumeThat(Assume.java:106) at org.junit.Assume.assumeTrue(Assume.java:50) at com.owncloud.android.AbstractIT.testOnlyOnServer(AbstractIT.java:205) at com.nextcloud.utils.AutoRenameTests.setup(AutoRenameTests.kt:30)
testEndInvalidFolderChar
org.junit.AssumptionViolatedException: got: <false>, expected: is <true> at org.junit.Assume.assumeThat(Assume.java:106) at org.junit.Assume.assumeTrue(Assume.java:50) at com.owncloud.android.AbstractIT.testOnlyOnServer(AbstractIT.java:205) at com.nextcloud.utils.AutoRenameTests.setup(AutoRenameTests.kt:30)
testEndNonPrintableChar
org.junit.AssumptionViolatedException: got: <false>, expected: is <true> at org.junit.Assume.assumeThat(Assume.java:106) at org.junit.Assume.assumeTrue(Assume.java:50) at com.owncloud.android.AbstractIT.testOnlyOnServer(AbstractIT.java:205) at com.nextcloud.utils.AutoRenameTests.setup(AutoRenameTests.kt:30)
testExtensionNonPrintableChar
org.junit.AssumptionViolatedException: got: <false>, expected: is <true> at org.junit.Assume.assumeThat(Assume.java:106) at org.junit.Assume.assumeTrue(Assume.java:50) at com.owncloud.android.AbstractIT.testOnlyOnServer(AbstractIT.java:205) at com.nextcloud.utils.AutoRenameTests.setup(AutoRenameTests.kt:30)
testFolderNameLowercase
org.junit.AssumptionViolatedException: got: <false>, expected: is <true> at org.junit.Assume.assumeThat(Assume.java:106) at org.junit.Assume.assumeTrue(Assume.java:50) at com.owncloud.android.AbstractIT.testOnlyOnServer(AbstractIT.java:205) at com.nextcloud.utils.AutoRenameTests.setup(AutoRenameTests.kt:30)
testInvalidChar
org.junit.AssumptionViolatedException: got: <false>, expected: is <true> at org.junit.Assume.assumeThat(Assume.java:106) at org.junit.Assume.assumeTrue(Assume.java:50) at com.owncloud.android.AbstractIT.testOnlyOnServer(AbstractIT.java:205) at com.nextcloud.utils.AutoRenameTests.setup(AutoRenameTests.kt:30)
testInvalidExtension
org.junit.AssumptionViolatedException: got: <false>, expected: is <true> at org.junit.Assume.assumeThat(Assume.java:106) at org.junit.Assume.assumeTrue(Assume.java:50) at com.owncloud.android.AbstractIT.testOnlyOnServer(AbstractIT.java:205) at com.nextcloud.utils.AutoRenameTests.setup(AutoRenameTests.kt:30)
testMiddleInvalidFolderChar
org.junit.AssumptionViolatedException: got: <false>, expected: is <true> at org.junit.Assume.assumeThat(Assume.java:106) at org.junit.Assume.assumeTrue(Assume.java:50) at com.owncloud.android.AbstractIT.testOnlyOnServer(AbstractIT.java:205) at com.nextcloud.utils.AutoRenameTests.setup(AutoRenameTests.kt:30)
testMiddleNonPrintableChar
org.junit.AssumptionViolatedException: got: <false>, expected: is <true> at org.junit.Assume.assumeThat(Assume.java:106) at org.junit.Assume.assumeTrue(Assume.java:50) at com.owncloud.android.AbstractIT.testOnlyOnServer(AbstractIT.java:205) at com.nextcloud.utils.AutoRenameTests.setup(AutoRenameTests.kt:30)
testMixedInvalidChar
org.junit.AssumptionViolatedException: got: <false>, expected: is <true> at org.junit.Assume.assumeThat(Assume.java:106) at org.junit.Assume.assumeTrue(Assume.java:50) at com.owncloud.android.AbstractIT.testOnlyOnServer(AbstractIT.java:205) at com.nextcloud.utils.AutoRenameTests.setup(AutoRenameTests.kt:30)
testMultipleInvalidChars
org.junit.AssumptionViolatedException: got: <false>, expected: is <true> at org.junit.Assume.assumeThat(Assume.java:106) at org.junit.Assume.assumeTrue(Assume.java:50) at com.owncloud.android.AbstractIT.testOnlyOnServer(AbstractIT.java:205) at com.nextcloud.utils.AutoRenameTests.setup(AutoRenameTests.kt:30)
testRemovingLeadingWhitespace
org.junit.AssumptionViolatedException: got: <false>, expected: is <true> at org.junit.Assume.assumeThat(Assume.java:106) at org.junit.Assume.assumeTrue(Assume.java:50) at com.owncloud.android.AbstractIT.testOnlyOnServer(AbstractIT.java:205) at com.nextcloud.utils.AutoRenameTests.setup(AutoRenameTests.kt:30)
testRemovingTrailingAndLeadingWhitespace
org.junit.AssumptionViolatedException: got: <false>, expected: is <true> at org.junit.Assume.assumeThat(Assume.java:106) at org.junit.Assume.assumeTrue(Assume.java:50) at com.owncloud.android.AbstractIT.testOnlyOnServer(AbstractIT.java:205) at com.nextcloud.utils.AutoRenameTests.setup(AutoRenameTests.kt:30)
testRemovingTrailingWhitespace
org.junit.AssumptionViolatedException: got: <false>, expected: is <true> at org.junit.Assume.assumeThat(Assume.java:106) at org.junit.Assume.assumeTrue(Assume.java:50) at com.owncloud.android.AbstractIT.testOnlyOnServer(AbstractIT.java:205) at com.nextcloud.utils.AutoRenameTests.setup(AutoRenameTests.kt:30)
testRenameExtensionForFile
org.junit.AssumptionViolatedException: got: <false>, expected: is <true> at org.junit.Assume.assumeThat(Assume.java:106) at org.junit.Assume.assumeTrue(Assume.java:50) at com.owncloud.android.AbstractIT.testOnlyOnServer(AbstractIT.java:205) at com.nextcloud.utils.AutoRenameTests.setup(AutoRenameTests.kt:30)
testRenameExtensionForFolder
org.junit.AssumptionViolatedException: got: <false>, expected: is <true> at org.junit.Assume.assumeThat(Assume.java:106) at org.junit.Assume.assumeTrue(Assume.java:50) at com.owncloud.android.AbstractIT.testOnlyOnServer(AbstractIT.java:205) at com.nextcloud.utils.AutoRenameTests.setup(AutoRenameTests.kt:30)
testRenameWithLowercasedFiles
org.junit.AssumptionViolatedException: got: <false>, expected: is <true> at org.junit.Assume.assumeThat(Assume.java:106) at org.junit.Assume.assumeTrue(Assume.java:50) at com.owncloud.android.AbstractIT.testOnlyOnServer(AbstractIT.java:205) at com.nextcloud.utils.AutoRenameTests.setup(AutoRenameTests.kt:30)
testStartEndInvalidExtensions
org.junit.AssumptionViolatedException: got: <false>, expected: is <true> at org.junit.Assume.assumeThat(Assume.java:106) at org.junit.Assume.assumeTrue(Assume.java:50) at com.owncloud.android.AbstractIT.testOnlyOnServer(AbstractIT.java:205) at com.nextcloud.utils.AutoRenameTests.setup(AutoRenameTests.kt:30)
testStartInvalidExtension
org.junit.AssumptionViolatedException: got: <false>, expected: is <true> at org.junit.Assume.assumeThat(Assume.java:106) at org.junit.Assume.assumeTrue(Assume.java:50) at com.owncloud.android.AbstractIT.testOnlyOnServer(AbstractIT.java:205) at com.nextcloud.utils.AutoRenameTests.setup(AutoRenameTests.kt:30)
testStartInvalidFolderChar
org.junit.AssumptionViolatedException: got: <false>, expected: is <true> at org.junit.Assume.assumeThat(Assume.java:106) at org.junit.Assume.assumeTrue(Assume.java:50) at com.owncloud.android.AbstractIT.testOnlyOnServer(AbstractIT.java:205) at com.nextcloud.utils.AutoRenameTests.setup(AutoRenameTests.kt:30)
testStartNonPrintableChar
org.junit.AssumptionViolatedException: got: <false>, expected: is <true> at org.junit.Assume.assumeThat(Assume.java:106) at org.junit.Assume.assumeTrue(Assume.java:50) at com.owncloud.android.AbstractIT.testOnlyOnServer(AbstractIT.java:205) at com.nextcloud.utils.AutoRenameTests.setup(AutoRenameTests.kt:30)
testStartsWithPathSeparator
org.junit.AssumptionViolatedException: got: <false>, expected: is <true> at org.junit.Assume.assumeThat(Assume.java:106) at org.junit.Assume.assumeTrue(Assume.java:50) at com.owncloud.android.AbstractIT.testOnlyOnServer(AbstractIT.java:205) at com.nextcloud.utils.AutoRenameTests.setup(AutoRenameTests.kt:30)
testStartsWithPathSeparatorAndValidFilepath
org.junit.AssumptionViolatedException: got: <false>, expected: is <true> at org.junit.Assume.assumeThat(Assume.java:106) at org.junit.Assume.assumeTrue(Assume.java:50) at com.owncloud.android.AbstractIT.testOnlyOnServer(AbstractIT.java:205) at com.nextcloud.utils.AutoRenameTests.setup(AutoRenameTests.kt:30)
testValidFilename
org.junit.AssumptionViolatedException: got: <false>, expected: is <true> at org.junit.Assume.assumeThat(Assume.java:106) at org.junit.Assume.assumeTrue(Assume.java:50) at com.owncloud.android.AbstractIT.testOnlyOnServer(AbstractIT.java:205) at com.nextcloud.utils.AutoRenameTests.setup(AutoRenameTests.kt:30)
testWCFDisabledOnNextcloud30to31ShouldStillApplyRestrictions
org.junit.AssumptionViolatedException: got: <false>, expected: is <true> at org.junit.Assume.assumeThat(Assume.java:106) at org.junit.Assume.assumeTrue(Assume.java:50) at com.owncloud.android.AbstractIT.testOnlyOnServer(AbstractIT.java:205) at com.nextcloud.utils.AutoRenameTests.setup(AutoRenameTests.kt:30)
testWCFDisabledOnNextcloud32ShouldSkipRestrictions
org.junit.AssumptionViolatedException: got: <false>, expected: is <true> at org.junit.Assume.assumeThat(Assume.java:106) at org.junit.Assume.assumeTrue(Assume.java:50) at com.owncloud.android.AbstractIT.testOnlyOnServer(AbstractIT.java:205) at com.nextcloud.utils.AutoRenameTests.setup(AutoRenameTests.kt:30)
testWCFEnabledOnNextcloud32ShouldApplyRestrictions
org.junit.AssumptionViolatedException: got: <false>, expected: is <true> at org.junit.Assume.assumeThat(Assume.java:106) at org.junit.Assume.assumeTrue(Assume.java:50) at com.owncloud.android.AbstractIT.testOnlyOnServer(AbstractIT.java:205) at com.nextcloud.utils.AutoRenameTests.setup(AutoRenameTests.kt:30)
testWCFOnNextcloudBelow30ShouldSkipRestrictions
org.junit.AssumptionViolatedException: got: <false>, expected: is <true> at org.junit.Assume.assumeThat(Assume.java:106) at org.junit.Assume.assumeTrue(Assume.java:50) at com.owncloud.android.AbstractIT.testOnlyOnServer(AbstractIT.java:205) at com.nextcloud.utils.AutoRenameTests.setup(AutoRenameTests.kt:30)
Tests
| Test | emulator-5554 |
|---|---|
| testE2EEFile | failed (0.356s) |
| testEndInvalidExtension | failed (0.325s) |
| testEndInvalidFolderChar | failed (0.335s) |
| testEndNonPrintableChar | failed (0.322s) |
| testExtensionNonPrintableChar | failed (0.304s) |
| testFolderNameLowercase | failed (0.313s) |
| testInvalidChar | failed (0.314s) |
| testInvalidExtension | failed (0.297s) |
| testMiddleInvalidFolderChar | failed (0.313s) |
| testMiddleNonPrintableChar | failed (0.326s) |
| testMixedInvalidChar | failed (0.318s) |
| testMultipleInvalidChars | failed (0.325s) |
| testRemovingLeadingWhitespace | failed (0.326s) |
| testRemovingTrailingAndLeadingWhitespace | failed (0.335s) |
| testRemovingTrailingWhitespace | failed (0.317s) |
| testRenameExtensionForFile | failed (0.345s) |
| testRenameExtensionForFolder | failed (0.341s) |
| testRenameWithLowercasedFiles | failed (0.314s) |
| testStartEndInvalidExtensions | failed (0.348s) |
| testStartInvalidExtension | failed (0.320s) |
| testStartInvalidFolderChar | failed (0.309s) |
| testStartNonPrintableChar | failed (0.330s) |
| testStartsWithPathSeparator | failed (0.322s) |
| testStartsWithPathSeparatorAndValidFilepath | failed (0.312s) |
| testValidFilename | failed (0.319s) |
| testWCFDisabledOnNextcloud30to31ShouldStillApplyRestrictions | failed (0.322s) |
| testWCFDisabledOnNextcloud32ShouldSkipRestrictions | failed (0.306s) |
| testWCFEnabledOnNextcloud32ShouldApplyRestrictions | failed (0.341s) |
| testWCFOnNextcloudBelow30ShouldSkipRestrictions | failed (0.324s) |