Class com.nextcloud.utils.AutoRenameTests
|
0%
successful |
Failed tests
testE2EEFile
org.junit.AssumptionViolatedException: got: <false>, expected: is <true> at org.junit.Assume.assumeThat(Assume.java:106) at org.junit.Assume.assumeTrue(Assume.java:50) at com.owncloud.android.AbstractIT.testOnlyOnServer(AbstractIT.java:205) at com.nextcloud.utils.AutoRenameTests.setup(AutoRenameTests.kt:31)
testEndInvalidExtension
org.junit.AssumptionViolatedException: got: <false>, expected: is <true> at org.junit.Assume.assumeThat(Assume.java:106) at org.junit.Assume.assumeTrue(Assume.java:50) at com.owncloud.android.AbstractIT.testOnlyOnServer(AbstractIT.java:205) at com.nextcloud.utils.AutoRenameTests.setup(AutoRenameTests.kt:31)
testEndInvalidFolderChar
org.junit.AssumptionViolatedException: got: <false>, expected: is <true> at org.junit.Assume.assumeThat(Assume.java:106) at org.junit.Assume.assumeTrue(Assume.java:50) at com.owncloud.android.AbstractIT.testOnlyOnServer(AbstractIT.java:205) at com.nextcloud.utils.AutoRenameTests.setup(AutoRenameTests.kt:31)
testEndNonPrintableChar
org.junit.AssumptionViolatedException: got: <false>, expected: is <true> at org.junit.Assume.assumeThat(Assume.java:106) at org.junit.Assume.assumeTrue(Assume.java:50) at com.owncloud.android.AbstractIT.testOnlyOnServer(AbstractIT.java:205) at com.nextcloud.utils.AutoRenameTests.setup(AutoRenameTests.kt:31)
testExtensionNonPrintableChar
org.junit.AssumptionViolatedException: got: <false>, expected: is <true> at org.junit.Assume.assumeThat(Assume.java:106) at org.junit.Assume.assumeTrue(Assume.java:50) at com.owncloud.android.AbstractIT.testOnlyOnServer(AbstractIT.java:205) at com.nextcloud.utils.AutoRenameTests.setup(AutoRenameTests.kt:31)
testFolderNameLowercase
org.junit.AssumptionViolatedException: got: <false>, expected: is <true> at org.junit.Assume.assumeThat(Assume.java:106) at org.junit.Assume.assumeTrue(Assume.java:50) at com.owncloud.android.AbstractIT.testOnlyOnServer(AbstractIT.java:205) at com.nextcloud.utils.AutoRenameTests.setup(AutoRenameTests.kt:31)
testInvalidChar
org.junit.AssumptionViolatedException: got: <false>, expected: is <true> at org.junit.Assume.assumeThat(Assume.java:106) at org.junit.Assume.assumeTrue(Assume.java:50) at com.owncloud.android.AbstractIT.testOnlyOnServer(AbstractIT.java:205) at com.nextcloud.utils.AutoRenameTests.setup(AutoRenameTests.kt:31)
testInvalidExtension
org.junit.AssumptionViolatedException: got: <false>, expected: is <true> at org.junit.Assume.assumeThat(Assume.java:106) at org.junit.Assume.assumeTrue(Assume.java:50) at com.owncloud.android.AbstractIT.testOnlyOnServer(AbstractIT.java:205) at com.nextcloud.utils.AutoRenameTests.setup(AutoRenameTests.kt:31)
testMiddleInvalidFolderChar
org.junit.AssumptionViolatedException: got: <false>, expected: is <true> at org.junit.Assume.assumeThat(Assume.java:106) at org.junit.Assume.assumeTrue(Assume.java:50) at com.owncloud.android.AbstractIT.testOnlyOnServer(AbstractIT.java:205) at com.nextcloud.utils.AutoRenameTests.setup(AutoRenameTests.kt:31)
testMiddleNonPrintableChar
org.junit.AssumptionViolatedException: got: <false>, expected: is <true> at org.junit.Assume.assumeThat(Assume.java:106) at org.junit.Assume.assumeTrue(Assume.java:50) at com.owncloud.android.AbstractIT.testOnlyOnServer(AbstractIT.java:205) at com.nextcloud.utils.AutoRenameTests.setup(AutoRenameTests.kt:31)
testMixedInvalidChar
org.junit.AssumptionViolatedException: got: <false>, expected: is <true> at org.junit.Assume.assumeThat(Assume.java:106) at org.junit.Assume.assumeTrue(Assume.java:50) at com.owncloud.android.AbstractIT.testOnlyOnServer(AbstractIT.java:205) at com.nextcloud.utils.AutoRenameTests.setup(AutoRenameTests.kt:31)
testMultipleInvalidChars
org.junit.AssumptionViolatedException: got: <false>, expected: is <true> at org.junit.Assume.assumeThat(Assume.java:106) at org.junit.Assume.assumeTrue(Assume.java:50) at com.owncloud.android.AbstractIT.testOnlyOnServer(AbstractIT.java:205) at com.nextcloud.utils.AutoRenameTests.setup(AutoRenameTests.kt:31)
testRemovingLeadingWhitespace
org.junit.AssumptionViolatedException: got: <false>, expected: is <true> at org.junit.Assume.assumeThat(Assume.java:106) at org.junit.Assume.assumeTrue(Assume.java:50) at com.owncloud.android.AbstractIT.testOnlyOnServer(AbstractIT.java:205) at com.nextcloud.utils.AutoRenameTests.setup(AutoRenameTests.kt:31)
testRemovingTrailingAndLeadingWhitespace
org.junit.AssumptionViolatedException: got: <false>, expected: is <true> at org.junit.Assume.assumeThat(Assume.java:106) at org.junit.Assume.assumeTrue(Assume.java:50) at com.owncloud.android.AbstractIT.testOnlyOnServer(AbstractIT.java:205) at com.nextcloud.utils.AutoRenameTests.setup(AutoRenameTests.kt:31)
testRemovingTrailingWhitespace
org.junit.AssumptionViolatedException: got: <false>, expected: is <true> at org.junit.Assume.assumeThat(Assume.java:106) at org.junit.Assume.assumeTrue(Assume.java:50) at com.owncloud.android.AbstractIT.testOnlyOnServer(AbstractIT.java:205) at com.nextcloud.utils.AutoRenameTests.setup(AutoRenameTests.kt:31)
testRenameExtensionForFile
org.junit.AssumptionViolatedException: got: <false>, expected: is <true> at org.junit.Assume.assumeThat(Assume.java:106) at org.junit.Assume.assumeTrue(Assume.java:50) at com.owncloud.android.AbstractIT.testOnlyOnServer(AbstractIT.java:205) at com.nextcloud.utils.AutoRenameTests.setup(AutoRenameTests.kt:31)
testRenameExtensionForFolder
org.junit.AssumptionViolatedException: got: <false>, expected: is <true> at org.junit.Assume.assumeThat(Assume.java:106) at org.junit.Assume.assumeTrue(Assume.java:50) at com.owncloud.android.AbstractIT.testOnlyOnServer(AbstractIT.java:205) at com.nextcloud.utils.AutoRenameTests.setup(AutoRenameTests.kt:31)
testRenameWithLowercasedFiles
org.junit.AssumptionViolatedException: got: <false>, expected: is <true> at org.junit.Assume.assumeThat(Assume.java:106) at org.junit.Assume.assumeTrue(Assume.java:50) at com.owncloud.android.AbstractIT.testOnlyOnServer(AbstractIT.java:205) at com.nextcloud.utils.AutoRenameTests.setup(AutoRenameTests.kt:31)
testStartEndInvalidExtensions
org.junit.AssumptionViolatedException: got: <false>, expected: is <true> at org.junit.Assume.assumeThat(Assume.java:106) at org.junit.Assume.assumeTrue(Assume.java:50) at com.owncloud.android.AbstractIT.testOnlyOnServer(AbstractIT.java:205) at com.nextcloud.utils.AutoRenameTests.setup(AutoRenameTests.kt:31)
testStartInvalidExtension
org.junit.AssumptionViolatedException: got: <false>, expected: is <true> at org.junit.Assume.assumeThat(Assume.java:106) at org.junit.Assume.assumeTrue(Assume.java:50) at com.owncloud.android.AbstractIT.testOnlyOnServer(AbstractIT.java:205) at com.nextcloud.utils.AutoRenameTests.setup(AutoRenameTests.kt:31)
testStartInvalidFolderChar
org.junit.AssumptionViolatedException: got: <false>, expected: is <true> at org.junit.Assume.assumeThat(Assume.java:106) at org.junit.Assume.assumeTrue(Assume.java:50) at com.owncloud.android.AbstractIT.testOnlyOnServer(AbstractIT.java:205) at com.nextcloud.utils.AutoRenameTests.setup(AutoRenameTests.kt:31)
testStartNonPrintableChar
org.junit.AssumptionViolatedException: got: <false>, expected: is <true> at org.junit.Assume.assumeThat(Assume.java:106) at org.junit.Assume.assumeTrue(Assume.java:50) at com.owncloud.android.AbstractIT.testOnlyOnServer(AbstractIT.java:205) at com.nextcloud.utils.AutoRenameTests.setup(AutoRenameTests.kt:31)
testStartsWithPathSeparator
org.junit.AssumptionViolatedException: got: <false>, expected: is <true> at org.junit.Assume.assumeThat(Assume.java:106) at org.junit.Assume.assumeTrue(Assume.java:50) at com.owncloud.android.AbstractIT.testOnlyOnServer(AbstractIT.java:205) at com.nextcloud.utils.AutoRenameTests.setup(AutoRenameTests.kt:31)
testStartsWithPathSeparatorAndValidFilepath
org.junit.AssumptionViolatedException: got: <false>, expected: is <true> at org.junit.Assume.assumeThat(Assume.java:106) at org.junit.Assume.assumeTrue(Assume.java:50) at com.owncloud.android.AbstractIT.testOnlyOnServer(AbstractIT.java:205) at com.nextcloud.utils.AutoRenameTests.setup(AutoRenameTests.kt:31)
testValidFilename
org.junit.AssumptionViolatedException: got: <false>, expected: is <true> at org.junit.Assume.assumeThat(Assume.java:106) at org.junit.Assume.assumeTrue(Assume.java:50) at com.owncloud.android.AbstractIT.testOnlyOnServer(AbstractIT.java:205) at com.nextcloud.utils.AutoRenameTests.setup(AutoRenameTests.kt:31)
testWCFDisabledOnNextcloud30to31ShouldStillApplyRestrictions
org.junit.AssumptionViolatedException: got: <false>, expected: is <true> at org.junit.Assume.assumeThat(Assume.java:106) at org.junit.Assume.assumeTrue(Assume.java:50) at com.owncloud.android.AbstractIT.testOnlyOnServer(AbstractIT.java:205) at com.nextcloud.utils.AutoRenameTests.setup(AutoRenameTests.kt:31)
testWCFDisabledOnNextcloud32ShouldSkipRestrictions
org.junit.AssumptionViolatedException: got: <false>, expected: is <true> at org.junit.Assume.assumeThat(Assume.java:106) at org.junit.Assume.assumeTrue(Assume.java:50) at com.owncloud.android.AbstractIT.testOnlyOnServer(AbstractIT.java:205) at com.nextcloud.utils.AutoRenameTests.setup(AutoRenameTests.kt:31)
testWCFEnabledOnNextcloud32ShouldApplyRestrictions
org.junit.AssumptionViolatedException: got: <false>, expected: is <true> at org.junit.Assume.assumeThat(Assume.java:106) at org.junit.Assume.assumeTrue(Assume.java:50) at com.owncloud.android.AbstractIT.testOnlyOnServer(AbstractIT.java:205) at com.nextcloud.utils.AutoRenameTests.setup(AutoRenameTests.kt:31)
testWCFOnNextcloudBelow30ShouldSkipRestrictions
org.junit.AssumptionViolatedException: got: <false>, expected: is <true> at org.junit.Assume.assumeThat(Assume.java:106) at org.junit.Assume.assumeTrue(Assume.java:50) at com.owncloud.android.AbstractIT.testOnlyOnServer(AbstractIT.java:205) at com.nextcloud.utils.AutoRenameTests.setup(AutoRenameTests.kt:31)
Tests
| Test | emulator-5554 |
|---|---|
| testE2EEFile | failed (0.555s) |
| testEndInvalidExtension | failed (0.551s) |
| testEndInvalidFolderChar | failed (0.542s) |
| testEndNonPrintableChar | failed (0.566s) |
| testExtensionNonPrintableChar | failed (0.532s) |
| testFolderNameLowercase | failed (0.525s) |
| testInvalidChar | failed (0.534s) |
| testInvalidExtension | failed (0.552s) |
| testMiddleInvalidFolderChar | failed (0.534s) |
| testMiddleNonPrintableChar | failed (0.533s) |
| testMixedInvalidChar | failed (0.552s) |
| testMultipleInvalidChars | failed (0.551s) |
| testRemovingLeadingWhitespace | failed (0.566s) |
| testRemovingTrailingAndLeadingWhitespace | failed (0.571s) |
| testRemovingTrailingWhitespace | failed (0.562s) |
| testRenameExtensionForFile | failed (0.531s) |
| testRenameExtensionForFolder | failed (0.544s) |
| testRenameWithLowercasedFiles | failed (0.552s) |
| testStartEndInvalidExtensions | failed (0.551s) |
| testStartInvalidExtension | failed (0.538s) |
| testStartInvalidFolderChar | failed (0.543s) |
| testStartNonPrintableChar | failed (0.556s) |
| testStartsWithPathSeparator | failed (0.553s) |
| testStartsWithPathSeparatorAndValidFilepath | failed (0.514s) |
| testValidFilename | failed (0.568s) |
| testWCFDisabledOnNextcloud30to31ShouldStillApplyRestrictions | failed (0.545s) |
| testWCFDisabledOnNextcloud32ShouldSkipRestrictions | failed (0.560s) |
| testWCFEnabledOnNextcloud32ShouldApplyRestrictions | failed (0.543s) |
| testWCFOnNextcloudBelow30ShouldSkipRestrictions | failed (0.549s) |