Class com.owncloud.android.operations.DeleteE2ERemoteOperationIT

3

tests

3

failures

0

skipped

5.268s

duration

0%

successful

Failed tests

testDeleteEncryptedFiles

java.lang.AssertionError
	at org.junit.Assert.fail(Assert.java:87)
	at org.junit.Assert.assertTrue(Assert.java:42)
	at org.junit.Assert.assertTrue(Assert.java:53)
	at com.owncloud.android.operations.DeleteE2ERemoteOperationIT.testDeleteEncryptedFiles(DeleteE2ERemoteOperationIT.kt:30)

testDeletePrivateKey

java.lang.AssertionError
	at org.junit.Assert.fail(Assert.java:87)
	at org.junit.Assert.assertTrue(Assert.java:42)
	at org.junit.Assert.assertTrue(Assert.java:53)
	at com.owncloud.android.operations.DeleteE2ERemoteOperationIT.testDeletePrivateKey(DeleteE2ERemoteOperationIT.kt:49)

testDeletePublicKey

java.lang.AssertionError
	at org.junit.Assert.fail(Assert.java:87)
	at org.junit.Assert.assertTrue(Assert.java:42)
	at org.junit.Assert.assertTrue(Assert.java:53)
	at com.owncloud.android.operations.DeleteE2ERemoteOperationIT.testDeletePublicKey(DeleteE2ERemoteOperationIT.kt:59)

Tests

Test emulator-5554
testDeleteEncryptedFiles failed (0.800s)
testDeletePrivateKey failed (3.644s)
testDeletePublicKey failed (0.824s)