Class com.owncloud.android.EncryptedFoldersIT

5

tests

5

failures

0

skipped

12.069s

duration

0%

successful

Failed tests

testCreateEncryptedFolder

java.lang.AssertionError
	at org.junit.Assert.fail(Assert.java:87)
	at org.junit.Assert.assertTrue(Assert.java:42)
	at org.junit.Assert.assertTrue(Assert.java:53)
	at com.owncloud.android.EncryptedFoldersIT.encryptionCleanup(EncryptedFoldersIT.kt:153)

testCreateEncryptedSubfolder

java.lang.AssertionError
	at org.junit.Assert.fail(Assert.java:87)
	at org.junit.Assert.assertTrue(Assert.java:42)
	at org.junit.Assert.assertTrue(Assert.java:53)
	at com.owncloud.android.EncryptedFoldersIT.encryptionCleanup(EncryptedFoldersIT.kt:153)

testReadEncryptedFolder

java.lang.AssertionError
	at org.junit.Assert.fail(Assert.java:87)
	at org.junit.Assert.assertTrue(Assert.java:42)
	at org.junit.Assert.assertTrue(Assert.java:53)
	at com.owncloud.android.EncryptedFoldersIT.encryptionCleanup(EncryptedFoldersIT.kt:153)

testReadEncryptedSubfolder

java.lang.AssertionError
	at org.junit.Assert.fail(Assert.java:87)
	at org.junit.Assert.assertTrue(Assert.java:42)
	at org.junit.Assert.assertTrue(Assert.java:53)
	at com.owncloud.android.EncryptedFoldersIT.encryptionCleanup(EncryptedFoldersIT.kt:153)

testUnencryptFolder

java.lang.AssertionError
	at org.junit.Assert.fail(Assert.java:87)
	at org.junit.Assert.assertTrue(Assert.java:42)
	at org.junit.Assert.assertTrue(Assert.java:53)
	at com.owncloud.android.EncryptedFoldersIT.encryptionCleanup(EncryptedFoldersIT.kt:153)

Tests

Test emulator-5554
testCreateEncryptedFolder failed (2.462s)
testCreateEncryptedSubfolder failed (2.382s)
testReadEncryptedFolder failed (2.391s)
testReadEncryptedSubfolder failed (2.361s)
testUnencryptFolder failed (2.473s)