Class com.owncloud.android.EncryptedFoldersIT
|
0%
successful |
Failed tests
testCreateEncryptedFolder
org.junit.AssumptionViolatedException: got: <false>, expected: is <true> at org.junit.Assume.assumeThat(Assume.java:106) at org.junit.Assume.assumeTrue(Assume.java:50) at com.owncloud.android.AbstractIT.testOnlyOnServer(AbstractIT.java:205) at com.owncloud.android.EncryptedFoldersIT.encryptionSetup(EncryptedFoldersIT.kt:127)
testCreateEncryptedSubfolder
org.junit.AssumptionViolatedException: got: <false>, expected: is <true> at org.junit.Assume.assumeThat(Assume.java:106) at org.junit.Assume.assumeTrue(Assume.java:50) at com.owncloud.android.AbstractIT.testOnlyOnServer(AbstractIT.java:205) at com.owncloud.android.EncryptedFoldersIT.encryptionSetup(EncryptedFoldersIT.kt:127)
testReadEncryptedFolder
org.junit.AssumptionViolatedException: got: <false>, expected: is <true> at org.junit.Assume.assumeThat(Assume.java:106) at org.junit.Assume.assumeTrue(Assume.java:50) at com.owncloud.android.AbstractIT.testOnlyOnServer(AbstractIT.java:205) at com.owncloud.android.EncryptedFoldersIT.encryptionSetup(EncryptedFoldersIT.kt:127)
testReadEncryptedSubfolder
org.junit.AssumptionViolatedException: got: <false>, expected: is <true> at org.junit.Assume.assumeThat(Assume.java:106) at org.junit.Assume.assumeTrue(Assume.java:50) at com.owncloud.android.AbstractIT.testOnlyOnServer(AbstractIT.java:205) at com.owncloud.android.EncryptedFoldersIT.encryptionSetup(EncryptedFoldersIT.kt:127)
testUnencryptFolder
org.junit.AssumptionViolatedException: got: <false>, expected: is <true> at org.junit.Assume.assumeThat(Assume.java:106) at org.junit.Assume.assumeTrue(Assume.java:50) at com.owncloud.android.AbstractIT.testOnlyOnServer(AbstractIT.java:205) at com.owncloud.android.EncryptedFoldersIT.encryptionSetup(EncryptedFoldersIT.kt:127)
Tests
| Test | emulator-5554 |
|---|---|
| testCreateEncryptedFolder | failed (1.150s) |
| testCreateEncryptedSubfolder | failed (1.162s) |
| testReadEncryptedFolder | failed (1.176s) |
| testReadEncryptedSubfolder | failed (1.170s) |
| testUnencryptFolder | failed (1.160s) |