Class com.nextcloud.client.files.download.TransferManagerConnectionTest

9

tests

9

failures

0

skipped

0.053s

duration

0%

successful

Failed tests

downloader_status_not_requested_if_no_listeners

java.lang.NoClassDefFoundError: io.mockk.impl.JvmMockKGateway
	at com.nextcloud.client.files.download.TransferManagerConnectionTest.setUp(TransferManagerConnectionTest.kt:242)
	... 31 trimmed
Caused by: java.lang.ExceptionInInitializerError
	at com.nextcloud.client.documentscan.GeneratePDFUseCaseTest.setUp(GeneratePDFUseCaseTest.kt:80)
	at java.lang.reflect.Method.invoke(Native Method)
	at org.junit.runners.model.FrameworkMethod$1.runReflectiveCall(FrameworkMethod.java:59)
	at org.junit.internal.runners.model.ReflectiveCallable.run(ReflectiveCallable.java:12)
	at org.junit.runners.model.FrameworkMethod.invokeExplosively(FrameworkMethod.java:56)
	at androidx.test.internal.runner.junit4.statement.RunBefores.evaluate(RunBefores.java:76)
	at androidx.test.internal.runner.junit4.statement.RunAfters.evaluate(RunAfters.java:61)
	at androidx.test.rule.GrantPermissionRule$RequestPermissionStatement.evaluate(GrantPermissionRule.java:150)
	at org.junit.runners.ParentRunner$3.evaluate(ParentRunner.java:306)
	at org.junit.runners.BlockJUnit4ClassRunner$1.evaluate(BlockJUnit4ClassRunner.java:100)
	at org.junit.runners.ParentRunner.runLeaf(ParentRunner.java:366)
	at org.junit.runners.BlockJUnit4ClassRunner.runChild(BlockJUnit4ClassRunner.java:103)
	at org.junit.runners.BlockJUnit4ClassRunner.runChild(BlockJUnit4ClassRunner.java:63)
	at org.junit.runners.ParentRunner$4.run(ParentRunner.java:331)
	at org.junit.runners.ParentRunner$1.schedule(ParentRunner.java:79)
	at org.junit.runners.ParentRunner.runChildren(ParentRunner.java:329)
	at org.junit.runners.ParentRunner.access$100(ParentRunner.java:66)
	at org.junit.runners.ParentRunner$2.evaluate(ParentRunner.java:293)
	at org.junit.internal.runners.statements.RunBefores.evaluate(RunBefores.java:26)
	... 17 more
Caused by: io.mockk.proxy.MockKAgentException: MockK failed to inject the AndroidMockKDispatcher class into the bootstrap class loader

It seems like your current VM does not support the jvmti API correctly.
	at io.mockk.proxy.android.AndroidMockKAgentFactory.init(AndroidMockKAgentFactory.kt:68)
	at io.mockk.impl.JvmMockKGateway.<init>(JvmMockKGateway.kt:82)
	at io.mockk.impl.JvmMockKGateway.<clinit>(JvmMockKGateway.kt:230)
	... 36 more
Caused by: java.lang.ClassNotFoundException: io.mockk.proxy.android.AndroidMockKDispatcher
	at java.lang.Class.classForName(Native Method)
	at java.lang.Class.forName(Class.java:454)
	at io.mockk.proxy.android.AndroidMockKAgentFactory.init(AndroidMockKAgentFactory.kt:62)
	... 38 more
Caused by: java.lang.ClassNotFoundException: io.mockk.proxy.android.AndroidMockKDispatcher
	at java.lang.Class.classForName(Native Method)
	at java.lang.BootClassLoader.findClass(ClassLoader.java:1358)
	at java.lang.BootClassLoader.loadClass(ClassLoader.java:1418)
	at java.lang.ClassLoader.loadClass(ClassLoader.java:312)
	... 41 more
Caused by: java.lang.NoClassDefFoundError: Class not found using the boot class loader; no stack trace available

downloader_status_updates_are_delivered_on_connection

java.lang.NoClassDefFoundError: io.mockk.impl.JvmMockKGateway
	at com.nextcloud.client.files.download.TransferManagerConnectionTest.setUp(TransferManagerConnectionTest.kt:242)
	... 31 trimmed
Caused by: java.lang.ExceptionInInitializerError
	at com.nextcloud.client.documentscan.GeneratePDFUseCaseTest.setUp(GeneratePDFUseCaseTest.kt:80)
	at java.lang.reflect.Method.invoke(Native Method)
	at org.junit.runners.model.FrameworkMethod$1.runReflectiveCall(FrameworkMethod.java:59)
	at org.junit.internal.runners.model.ReflectiveCallable.run(ReflectiveCallable.java:12)
	at org.junit.runners.model.FrameworkMethod.invokeExplosively(FrameworkMethod.java:56)
	at androidx.test.internal.runner.junit4.statement.RunBefores.evaluate(RunBefores.java:76)
	at androidx.test.internal.runner.junit4.statement.RunAfters.evaluate(RunAfters.java:61)
	at androidx.test.rule.GrantPermissionRule$RequestPermissionStatement.evaluate(GrantPermissionRule.java:150)
	at org.junit.runners.ParentRunner$3.evaluate(ParentRunner.java:306)
	at org.junit.runners.BlockJUnit4ClassRunner$1.evaluate(BlockJUnit4ClassRunner.java:100)
	at org.junit.runners.ParentRunner.runLeaf(ParentRunner.java:366)
	at org.junit.runners.BlockJUnit4ClassRunner.runChild(BlockJUnit4ClassRunner.java:103)
	at org.junit.runners.BlockJUnit4ClassRunner.runChild(BlockJUnit4ClassRunner.java:63)
	at org.junit.runners.ParentRunner$4.run(ParentRunner.java:331)
	at org.junit.runners.ParentRunner$1.schedule(ParentRunner.java:79)
	at org.junit.runners.ParentRunner.runChildren(ParentRunner.java:329)
	at org.junit.runners.ParentRunner.access$100(ParentRunner.java:66)
	at org.junit.runners.ParentRunner$2.evaluate(ParentRunner.java:293)
	at org.junit.internal.runners.statements.RunBefores.evaluate(RunBefores.java:26)
	... 17 more
Caused by: io.mockk.proxy.MockKAgentException: MockK failed to inject the AndroidMockKDispatcher class into the bootstrap class loader

It seems like your current VM does not support the jvmti API correctly.
	at io.mockk.proxy.android.AndroidMockKAgentFactory.init(AndroidMockKAgentFactory.kt:68)
	at io.mockk.impl.JvmMockKGateway.<init>(JvmMockKGateway.kt:82)
	at io.mockk.impl.JvmMockKGateway.<clinit>(JvmMockKGateway.kt:230)
	... 36 more
Caused by: java.lang.ClassNotFoundException: io.mockk.proxy.android.AndroidMockKDispatcher
	at java.lang.Class.classForName(Native Method)
	at java.lang.Class.forName(Class.java:454)
	at io.mockk.proxy.android.AndroidMockKAgentFactory.init(AndroidMockKAgentFactory.kt:62)
	... 38 more
Caused by: java.lang.ClassNotFoundException: io.mockk.proxy.android.AndroidMockKDispatcher
	at java.lang.Class.classForName(Native Method)
	at java.lang.BootClassLoader.findClass(ClassLoader.java:1358)
	at java.lang.BootClassLoader.loadClass(ClassLoader.java:1418)
	at java.lang.ClassLoader.loadClass(ClassLoader.java:312)
	... 41 more
Caused by: java.lang.NoClassDefFoundError: Class not found using the boot class loader; no stack trace available

is_running_from_binder_if_connected

java.lang.NoClassDefFoundError: io.mockk.impl.JvmMockKGateway
	at com.nextcloud.client.files.download.TransferManagerConnectionTest.setUp(TransferManagerConnectionTest.kt:242)
	... 31 trimmed
Caused by: java.lang.ExceptionInInitializerError
	at com.nextcloud.client.documentscan.GeneratePDFUseCaseTest.setUp(GeneratePDFUseCaseTest.kt:80)
	at java.lang.reflect.Method.invoke(Native Method)
	at org.junit.runners.model.FrameworkMethod$1.runReflectiveCall(FrameworkMethod.java:59)
	at org.junit.internal.runners.model.ReflectiveCallable.run(ReflectiveCallable.java:12)
	at org.junit.runners.model.FrameworkMethod.invokeExplosively(FrameworkMethod.java:56)
	at androidx.test.internal.runner.junit4.statement.RunBefores.evaluate(RunBefores.java:76)
	at androidx.test.internal.runner.junit4.statement.RunAfters.evaluate(RunAfters.java:61)
	at androidx.test.rule.GrantPermissionRule$RequestPermissionStatement.evaluate(GrantPermissionRule.java:150)
	at org.junit.runners.ParentRunner$3.evaluate(ParentRunner.java:306)
	at org.junit.runners.BlockJUnit4ClassRunner$1.evaluate(BlockJUnit4ClassRunner.java:100)
	at org.junit.runners.ParentRunner.runLeaf(ParentRunner.java:366)
	at org.junit.runners.BlockJUnit4ClassRunner.runChild(BlockJUnit4ClassRunner.java:103)
	at org.junit.runners.BlockJUnit4ClassRunner.runChild(BlockJUnit4ClassRunner.java:63)
	at org.junit.runners.ParentRunner$4.run(ParentRunner.java:331)
	at org.junit.runners.ParentRunner$1.schedule(ParentRunner.java:79)
	at org.junit.runners.ParentRunner.runChildren(ParentRunner.java:329)
	at org.junit.runners.ParentRunner.access$100(ParentRunner.java:66)
	at org.junit.runners.ParentRunner$2.evaluate(ParentRunner.java:293)
	at org.junit.internal.runners.statements.RunBefores.evaluate(RunBefores.java:26)
	... 17 more
Caused by: io.mockk.proxy.MockKAgentException: MockK failed to inject the AndroidMockKDispatcher class into the bootstrap class loader

It seems like your current VM does not support the jvmti API correctly.
	at io.mockk.proxy.android.AndroidMockKAgentFactory.init(AndroidMockKAgentFactory.kt:68)
	at io.mockk.impl.JvmMockKGateway.<init>(JvmMockKGateway.kt:82)
	at io.mockk.impl.JvmMockKGateway.<clinit>(JvmMockKGateway.kt:230)
	... 36 more
Caused by: java.lang.ClassNotFoundException: io.mockk.proxy.android.AndroidMockKDispatcher
	at java.lang.Class.classForName(Native Method)
	at java.lang.Class.forName(Class.java:454)
	at io.mockk.proxy.android.AndroidMockKAgentFactory.init(AndroidMockKAgentFactory.kt:62)
	... 38 more
Caused by: java.lang.ClassNotFoundException: io.mockk.proxy.android.AndroidMockKDispatcher
	at java.lang.Class.classForName(Native Method)
	at java.lang.BootClassLoader.findClass(ClassLoader.java:1358)
	at java.lang.BootClassLoader.loadClass(ClassLoader.java:1418)
	at java.lang.ClassLoader.loadClass(ClassLoader.java:312)
	... 41 more
Caused by: java.lang.NoClassDefFoundError: Class not found using the boot class loader; no stack trace available

listeners_are_removed_when_unbinding

java.lang.NoClassDefFoundError: io.mockk.impl.JvmMockKGateway
	at com.nextcloud.client.files.download.TransferManagerConnectionTest.setUp(TransferManagerConnectionTest.kt:242)
	... 31 trimmed
Caused by: java.lang.ExceptionInInitializerError
	at com.nextcloud.client.documentscan.GeneratePDFUseCaseTest.setUp(GeneratePDFUseCaseTest.kt:80)
	at java.lang.reflect.Method.invoke(Native Method)
	at org.junit.runners.model.FrameworkMethod$1.runReflectiveCall(FrameworkMethod.java:59)
	at org.junit.internal.runners.model.ReflectiveCallable.run(ReflectiveCallable.java:12)
	at org.junit.runners.model.FrameworkMethod.invokeExplosively(FrameworkMethod.java:56)
	at androidx.test.internal.runner.junit4.statement.RunBefores.evaluate(RunBefores.java:76)
	at androidx.test.internal.runner.junit4.statement.RunAfters.evaluate(RunAfters.java:61)
	at androidx.test.rule.GrantPermissionRule$RequestPermissionStatement.evaluate(GrantPermissionRule.java:150)
	at org.junit.runners.ParentRunner$3.evaluate(ParentRunner.java:306)
	at org.junit.runners.BlockJUnit4ClassRunner$1.evaluate(BlockJUnit4ClassRunner.java:100)
	at org.junit.runners.ParentRunner.runLeaf(ParentRunner.java:366)
	at org.junit.runners.BlockJUnit4ClassRunner.runChild(BlockJUnit4ClassRunner.java:103)
	at org.junit.runners.BlockJUnit4ClassRunner.runChild(BlockJUnit4ClassRunner.java:63)
	at org.junit.runners.ParentRunner$4.run(ParentRunner.java:331)
	at org.junit.runners.ParentRunner$1.schedule(ParentRunner.java:79)
	at org.junit.runners.ParentRunner.runChildren(ParentRunner.java:329)
	at org.junit.runners.ParentRunner.access$100(ParentRunner.java:66)
	at org.junit.runners.ParentRunner$2.evaluate(ParentRunner.java:293)
	at org.junit.internal.runners.statements.RunBefores.evaluate(RunBefores.java:26)
	... 17 more
Caused by: io.mockk.proxy.MockKAgentException: MockK failed to inject the AndroidMockKDispatcher class into the bootstrap class loader

It seems like your current VM does not support the jvmti API correctly.
	at io.mockk.proxy.android.AndroidMockKAgentFactory.init(AndroidMockKAgentFactory.kt:68)
	at io.mockk.impl.JvmMockKGateway.<init>(JvmMockKGateway.kt:82)
	at io.mockk.impl.JvmMockKGateway.<clinit>(JvmMockKGateway.kt:230)
	... 36 more
Caused by: java.lang.ClassNotFoundException: io.mockk.proxy.android.AndroidMockKDispatcher
	at java.lang.Class.classForName(Native Method)
	at java.lang.Class.forName(Class.java:454)
	at io.mockk.proxy.android.AndroidMockKAgentFactory.init(AndroidMockKAgentFactory.kt:62)
	... 38 more
Caused by: java.lang.ClassNotFoundException: io.mockk.proxy.android.AndroidMockKDispatcher
	at java.lang.Class.classForName(Native Method)
	at java.lang.BootClassLoader.findClass(ClassLoader.java:1358)
	at java.lang.BootClassLoader.loadClass(ClassLoader.java:1418)
	at java.lang.ClassLoader.loadClass(ClassLoader.java:312)
	... 41 more
Caused by: java.lang.NoClassDefFoundError: Class not found using the boot class loader; no stack trace available

listeners_are_set_after_connection

java.lang.NoClassDefFoundError: io.mockk.impl.JvmMockKGateway
	at com.nextcloud.client.files.download.TransferManagerConnectionTest.setUp(TransferManagerConnectionTest.kt:242)
	... 31 trimmed
Caused by: java.lang.ExceptionInInitializerError
	at com.nextcloud.client.documentscan.GeneratePDFUseCaseTest.setUp(GeneratePDFUseCaseTest.kt:80)
	at java.lang.reflect.Method.invoke(Native Method)
	at org.junit.runners.model.FrameworkMethod$1.runReflectiveCall(FrameworkMethod.java:59)
	at org.junit.internal.runners.model.ReflectiveCallable.run(ReflectiveCallable.java:12)
	at org.junit.runners.model.FrameworkMethod.invokeExplosively(FrameworkMethod.java:56)
	at androidx.test.internal.runner.junit4.statement.RunBefores.evaluate(RunBefores.java:76)
	at androidx.test.internal.runner.junit4.statement.RunAfters.evaluate(RunAfters.java:61)
	at androidx.test.rule.GrantPermissionRule$RequestPermissionStatement.evaluate(GrantPermissionRule.java:150)
	at org.junit.runners.ParentRunner$3.evaluate(ParentRunner.java:306)
	at org.junit.runners.BlockJUnit4ClassRunner$1.evaluate(BlockJUnit4ClassRunner.java:100)
	at org.junit.runners.ParentRunner.runLeaf(ParentRunner.java:366)
	at org.junit.runners.BlockJUnit4ClassRunner.runChild(BlockJUnit4ClassRunner.java:103)
	at org.junit.runners.BlockJUnit4ClassRunner.runChild(BlockJUnit4ClassRunner.java:63)
	at org.junit.runners.ParentRunner$4.run(ParentRunner.java:331)
	at org.junit.runners.ParentRunner$1.schedule(ParentRunner.java:79)
	at org.junit.runners.ParentRunner.runChildren(ParentRunner.java:329)
	at org.junit.runners.ParentRunner.access$100(ParentRunner.java:66)
	at org.junit.runners.ParentRunner$2.evaluate(ParentRunner.java:293)
	at org.junit.internal.runners.statements.RunBefores.evaluate(RunBefores.java:26)
	... 17 more
Caused by: io.mockk.proxy.MockKAgentException: MockK failed to inject the AndroidMockKDispatcher class into the bootstrap class loader

It seems like your current VM does not support the jvmti API correctly.
	at io.mockk.proxy.android.AndroidMockKAgentFactory.init(AndroidMockKAgentFactory.kt:68)
	at io.mockk.impl.JvmMockKGateway.<init>(JvmMockKGateway.kt:82)
	at io.mockk.impl.JvmMockKGateway.<clinit>(JvmMockKGateway.kt:230)
	... 36 more
Caused by: java.lang.ClassNotFoundException: io.mockk.proxy.android.AndroidMockKDispatcher
	at java.lang.Class.classForName(Native Method)
	at java.lang.Class.forName(Class.java:454)
	at io.mockk.proxy.android.AndroidMockKAgentFactory.init(AndroidMockKAgentFactory.kt:62)
	... 38 more
Caused by: java.lang.ClassNotFoundException: io.mockk.proxy.android.AndroidMockKDispatcher
	at java.lang.Class.classForName(Native Method)
	at java.lang.BootClassLoader.findClass(ClassLoader.java:1358)
	at java.lang.BootClassLoader.loadClass(ClassLoader.java:1418)
	at java.lang.ClassLoader.loadClass(ClassLoader.java:312)
	... 41 more
Caused by: java.lang.NoClassDefFoundError: Class not found using the boot class loader; no stack trace available

listeners_are_set_immediately_when_connected

java.lang.NoClassDefFoundError: io.mockk.impl.JvmMockKGateway
	at com.nextcloud.client.files.download.TransferManagerConnectionTest.setUp(TransferManagerConnectionTest.kt:242)
	... 31 trimmed
Caused by: java.lang.ExceptionInInitializerError
	at com.nextcloud.client.documentscan.GeneratePDFUseCaseTest.setUp(GeneratePDFUseCaseTest.kt:80)
	at java.lang.reflect.Method.invoke(Native Method)
	at org.junit.runners.model.FrameworkMethod$1.runReflectiveCall(FrameworkMethod.java:59)
	at org.junit.internal.runners.model.ReflectiveCallable.run(ReflectiveCallable.java:12)
	at org.junit.runners.model.FrameworkMethod.invokeExplosively(FrameworkMethod.java:56)
	at androidx.test.internal.runner.junit4.statement.RunBefores.evaluate(RunBefores.java:76)
	at androidx.test.internal.runner.junit4.statement.RunAfters.evaluate(RunAfters.java:61)
	at androidx.test.rule.GrantPermissionRule$RequestPermissionStatement.evaluate(GrantPermissionRule.java:150)
	at org.junit.runners.ParentRunner$3.evaluate(ParentRunner.java:306)
	at org.junit.runners.BlockJUnit4ClassRunner$1.evaluate(BlockJUnit4ClassRunner.java:100)
	at org.junit.runners.ParentRunner.runLeaf(ParentRunner.java:366)
	at org.junit.runners.BlockJUnit4ClassRunner.runChild(BlockJUnit4ClassRunner.java:103)
	at org.junit.runners.BlockJUnit4ClassRunner.runChild(BlockJUnit4ClassRunner.java:63)
	at org.junit.runners.ParentRunner$4.run(ParentRunner.java:331)
	at org.junit.runners.ParentRunner$1.schedule(ParentRunner.java:79)
	at org.junit.runners.ParentRunner.runChildren(ParentRunner.java:329)
	at org.junit.runners.ParentRunner.access$100(ParentRunner.java:66)
	at org.junit.runners.ParentRunner$2.evaluate(ParentRunner.java:293)
	at org.junit.internal.runners.statements.RunBefores.evaluate(RunBefores.java:26)
	... 17 more
Caused by: io.mockk.proxy.MockKAgentException: MockK failed to inject the AndroidMockKDispatcher class into the bootstrap class loader

It seems like your current VM does not support the jvmti API correctly.
	at io.mockk.proxy.android.AndroidMockKAgentFactory.init(AndroidMockKAgentFactory.kt:68)
	at io.mockk.impl.JvmMockKGateway.<init>(JvmMockKGateway.kt:82)
	at io.mockk.impl.JvmMockKGateway.<clinit>(JvmMockKGateway.kt:230)
	... 36 more
Caused by: java.lang.ClassNotFoundException: io.mockk.proxy.android.AndroidMockKDispatcher
	at java.lang.Class.classForName(Native Method)
	at java.lang.Class.forName(Class.java:454)
	at io.mockk.proxy.android.AndroidMockKAgentFactory.init(AndroidMockKAgentFactory.kt:62)
	... 38 more
Caused by: java.lang.ClassNotFoundException: io.mockk.proxy.android.AndroidMockKDispatcher
	at java.lang.Class.classForName(Native Method)
	at java.lang.BootClassLoader.findClass(ClassLoader.java:1358)
	at java.lang.BootClassLoader.loadClass(ClassLoader.java:1418)
	at java.lang.ClassLoader.loadClass(ClassLoader.java:312)
	... 41 more
Caused by: java.lang.NoClassDefFoundError: Class not found using the boot class loader; no stack trace available

missed_updates_are_delivered_on_connection

java.lang.NoClassDefFoundError: io.mockk.impl.JvmMockKGateway
	at com.nextcloud.client.files.download.TransferManagerConnectionTest.setUp(TransferManagerConnectionTest.kt:242)
	... 31 trimmed
Caused by: java.lang.ExceptionInInitializerError
	at com.nextcloud.client.documentscan.GeneratePDFUseCaseTest.setUp(GeneratePDFUseCaseTest.kt:80)
	at java.lang.reflect.Method.invoke(Native Method)
	at org.junit.runners.model.FrameworkMethod$1.runReflectiveCall(FrameworkMethod.java:59)
	at org.junit.internal.runners.model.ReflectiveCallable.run(ReflectiveCallable.java:12)
	at org.junit.runners.model.FrameworkMethod.invokeExplosively(FrameworkMethod.java:56)
	at androidx.test.internal.runner.junit4.statement.RunBefores.evaluate(RunBefores.java:76)
	at androidx.test.internal.runner.junit4.statement.RunAfters.evaluate(RunAfters.java:61)
	at androidx.test.rule.GrantPermissionRule$RequestPermissionStatement.evaluate(GrantPermissionRule.java:150)
	at org.junit.runners.ParentRunner$3.evaluate(ParentRunner.java:306)
	at org.junit.runners.BlockJUnit4ClassRunner$1.evaluate(BlockJUnit4ClassRunner.java:100)
	at org.junit.runners.ParentRunner.runLeaf(ParentRunner.java:366)
	at org.junit.runners.BlockJUnit4ClassRunner.runChild(BlockJUnit4ClassRunner.java:103)
	at org.junit.runners.BlockJUnit4ClassRunner.runChild(BlockJUnit4ClassRunner.java:63)
	at org.junit.runners.ParentRunner$4.run(ParentRunner.java:331)
	at org.junit.runners.ParentRunner$1.schedule(ParentRunner.java:79)
	at org.junit.runners.ParentRunner.runChildren(ParentRunner.java:329)
	at org.junit.runners.ParentRunner.access$100(ParentRunner.java:66)
	at org.junit.runners.ParentRunner$2.evaluate(ParentRunner.java:293)
	at org.junit.internal.runners.statements.RunBefores.evaluate(RunBefores.java:26)
	... 17 more
Caused by: io.mockk.proxy.MockKAgentException: MockK failed to inject the AndroidMockKDispatcher class into the bootstrap class loader

It seems like your current VM does not support the jvmti API correctly.
	at io.mockk.proxy.android.AndroidMockKAgentFactory.init(AndroidMockKAgentFactory.kt:68)
	at io.mockk.impl.JvmMockKGateway.<init>(JvmMockKGateway.kt:82)
	at io.mockk.impl.JvmMockKGateway.<clinit>(JvmMockKGateway.kt:230)
	... 36 more
Caused by: java.lang.ClassNotFoundException: io.mockk.proxy.android.AndroidMockKDispatcher
	at java.lang.Class.classForName(Native Method)
	at java.lang.Class.forName(Class.java:454)
	at io.mockk.proxy.android.AndroidMockKAgentFactory.init(AndroidMockKAgentFactory.kt:62)
	... 38 more
Caused by: java.lang.ClassNotFoundException: io.mockk.proxy.android.AndroidMockKDispatcher
	at java.lang.Class.classForName(Native Method)
	at java.lang.BootClassLoader.findClass(ClassLoader.java:1358)
	at java.lang.BootClassLoader.loadClass(ClassLoader.java:1418)
	at java.lang.ClassLoader.loadClass(ClassLoader.java:312)
	... 41 more
Caused by: java.lang.NoClassDefFoundError: Class not found using the boot class loader; no stack trace available

missed_updates_not_tracked_before_listeners_registered

java.lang.NoClassDefFoundError: io.mockk.impl.JvmMockKGateway
	at com.nextcloud.client.files.download.TransferManagerConnectionTest.setUp(TransferManagerConnectionTest.kt:242)
	... 31 trimmed
Caused by: java.lang.ExceptionInInitializerError
	at com.nextcloud.client.documentscan.GeneratePDFUseCaseTest.setUp(GeneratePDFUseCaseTest.kt:80)
	at java.lang.reflect.Method.invoke(Native Method)
	at org.junit.runners.model.FrameworkMethod$1.runReflectiveCall(FrameworkMethod.java:59)
	at org.junit.internal.runners.model.ReflectiveCallable.run(ReflectiveCallable.java:12)
	at org.junit.runners.model.FrameworkMethod.invokeExplosively(FrameworkMethod.java:56)
	at androidx.test.internal.runner.junit4.statement.RunBefores.evaluate(RunBefores.java:76)
	at androidx.test.internal.runner.junit4.statement.RunAfters.evaluate(RunAfters.java:61)
	at androidx.test.rule.GrantPermissionRule$RequestPermissionStatement.evaluate(GrantPermissionRule.java:150)
	at org.junit.runners.ParentRunner$3.evaluate(ParentRunner.java:306)
	at org.junit.runners.BlockJUnit4ClassRunner$1.evaluate(BlockJUnit4ClassRunner.java:100)
	at org.junit.runners.ParentRunner.runLeaf(ParentRunner.java:366)
	at org.junit.runners.BlockJUnit4ClassRunner.runChild(BlockJUnit4ClassRunner.java:103)
	at org.junit.runners.BlockJUnit4ClassRunner.runChild(BlockJUnit4ClassRunner.java:63)
	at org.junit.runners.ParentRunner$4.run(ParentRunner.java:331)
	at org.junit.runners.ParentRunner$1.schedule(ParentRunner.java:79)
	at org.junit.runners.ParentRunner.runChildren(ParentRunner.java:329)
	at org.junit.runners.ParentRunner.access$100(ParentRunner.java:66)
	at org.junit.runners.ParentRunner$2.evaluate(ParentRunner.java:293)
	at org.junit.internal.runners.statements.RunBefores.evaluate(RunBefores.java:26)
	... 17 more
Caused by: io.mockk.proxy.MockKAgentException: MockK failed to inject the AndroidMockKDispatcher class into the bootstrap class loader

It seems like your current VM does not support the jvmti API correctly.
	at io.mockk.proxy.android.AndroidMockKAgentFactory.init(AndroidMockKAgentFactory.kt:68)
	at io.mockk.impl.JvmMockKGateway.<init>(JvmMockKGateway.kt:82)
	at io.mockk.impl.JvmMockKGateway.<clinit>(JvmMockKGateway.kt:230)
	... 36 more
Caused by: java.lang.ClassNotFoundException: io.mockk.proxy.android.AndroidMockKDispatcher
	at java.lang.Class.classForName(Native Method)
	at java.lang.Class.forName(Class.java:454)
	at io.mockk.proxy.android.AndroidMockKAgentFactory.init(AndroidMockKAgentFactory.kt:62)
	... 38 more
Caused by: java.lang.ClassNotFoundException: io.mockk.proxy.android.AndroidMockKDispatcher
	at java.lang.Class.classForName(Native Method)
	at java.lang.BootClassLoader.findClass(ClassLoader.java:1358)
	at java.lang.BootClassLoader.loadClass(ClassLoader.java:1418)
	at java.lang.ClassLoader.loadClass(ClassLoader.java:312)
	... 41 more
Caused by: java.lang.NoClassDefFoundError: Class not found using the boot class loader; no stack trace available

not_running_if_not_connected

java.lang.NoClassDefFoundError: io.mockk.impl.JvmMockKGateway
	at com.nextcloud.client.files.download.TransferManagerConnectionTest.setUp(TransferManagerConnectionTest.kt:242)
	... 31 trimmed
Caused by: java.lang.ExceptionInInitializerError
	at com.nextcloud.client.documentscan.GeneratePDFUseCaseTest.setUp(GeneratePDFUseCaseTest.kt:80)
	at java.lang.reflect.Method.invoke(Native Method)
	at org.junit.runners.model.FrameworkMethod$1.runReflectiveCall(FrameworkMethod.java:59)
	at org.junit.internal.runners.model.ReflectiveCallable.run(ReflectiveCallable.java:12)
	at org.junit.runners.model.FrameworkMethod.invokeExplosively(FrameworkMethod.java:56)
	at androidx.test.internal.runner.junit4.statement.RunBefores.evaluate(RunBefores.java:76)
	at androidx.test.internal.runner.junit4.statement.RunAfters.evaluate(RunAfters.java:61)
	at androidx.test.rule.GrantPermissionRule$RequestPermissionStatement.evaluate(GrantPermissionRule.java:150)
	at org.junit.runners.ParentRunner$3.evaluate(ParentRunner.java:306)
	at org.junit.runners.BlockJUnit4ClassRunner$1.evaluate(BlockJUnit4ClassRunner.java:100)
	at org.junit.runners.ParentRunner.runLeaf(ParentRunner.java:366)
	at org.junit.runners.BlockJUnit4ClassRunner.runChild(BlockJUnit4ClassRunner.java:103)
	at org.junit.runners.BlockJUnit4ClassRunner.runChild(BlockJUnit4ClassRunner.java:63)
	at org.junit.runners.ParentRunner$4.run(ParentRunner.java:331)
	at org.junit.runners.ParentRunner$1.schedule(ParentRunner.java:79)
	at org.junit.runners.ParentRunner.runChildren(ParentRunner.java:329)
	at org.junit.runners.ParentRunner.access$100(ParentRunner.java:66)
	at org.junit.runners.ParentRunner$2.evaluate(ParentRunner.java:293)
	at org.junit.internal.runners.statements.RunBefores.evaluate(RunBefores.java:26)
	... 17 more
Caused by: io.mockk.proxy.MockKAgentException: MockK failed to inject the AndroidMockKDispatcher class into the bootstrap class loader

It seems like your current VM does not support the jvmti API correctly.
	at io.mockk.proxy.android.AndroidMockKAgentFactory.init(AndroidMockKAgentFactory.kt:68)
	at io.mockk.impl.JvmMockKGateway.<init>(JvmMockKGateway.kt:82)
	at io.mockk.impl.JvmMockKGateway.<clinit>(JvmMockKGateway.kt:230)
	... 36 more
Caused by: java.lang.ClassNotFoundException: io.mockk.proxy.android.AndroidMockKDispatcher
	at java.lang.Class.classForName(Native Method)
	at java.lang.Class.forName(Class.java:454)
	at io.mockk.proxy.android.AndroidMockKAgentFactory.init(AndroidMockKAgentFactory.kt:62)
	... 38 more
Caused by: java.lang.ClassNotFoundException: io.mockk.proxy.android.AndroidMockKDispatcher
	at java.lang.Class.classForName(Native Method)
	at java.lang.BootClassLoader.findClass(ClassLoader.java:1358)
	at java.lang.BootClassLoader.loadClass(ClassLoader.java:1418)
	at java.lang.ClassLoader.loadClass(ClassLoader.java:312)
	... 41 more
Caused by: java.lang.NoClassDefFoundError: Class not found using the boot class loader; no stack trace available

Tests

Test emulator-5554
downloader_status_not_requested_if_no_listeners failed (0s)
downloader_status_updates_are_delivered_on_connection failed (0.005s)
is_running_from_binder_if_connected failed (0.010s)
listeners_are_removed_when_unbinding failed (0.011s)
listeners_are_set_after_connection failed (0.003s)
listeners_are_set_immediately_when_connected failed (0.010s)
missed_updates_are_delivered_on_connection failed (0s)
missed_updates_not_tracked_before_listeners_registered failed (0.007s)
not_running_if_not_connected failed (0.007s)