Class com.nextcloud.client.files.download.RegistryTest$IsRunning
|
0%
successful |
Failed tests
no_requests
java.lang.NoClassDefFoundError: io.mockk.impl.JvmMockKGateway at com.nextcloud.client.files.download.RegistryTest$Base.setUpBase(RegistryTest.kt:523) ... 40 trimmed Caused by: java.lang.ExceptionInInitializerError at com.nextcloud.client.documentscan.GeneratePDFUseCaseTest.setUp(GeneratePDFUseCaseTest.kt:80) at java.lang.reflect.Method.invoke(Native Method) at org.junit.runners.model.FrameworkMethod$1.runReflectiveCall(FrameworkMethod.java:59) at org.junit.internal.runners.model.ReflectiveCallable.run(ReflectiveCallable.java:12) at org.junit.runners.model.FrameworkMethod.invokeExplosively(FrameworkMethod.java:56) at androidx.test.internal.runner.junit4.statement.RunBefores.evaluate(RunBefores.java:76) at androidx.test.internal.runner.junit4.statement.RunAfters.evaluate(RunAfters.java:61) at androidx.test.rule.GrantPermissionRule$RequestPermissionStatement.evaluate(GrantPermissionRule.java:150) at org.junit.runners.ParentRunner$3.evaluate(ParentRunner.java:306) at org.junit.runners.BlockJUnit4ClassRunner$1.evaluate(BlockJUnit4ClassRunner.java:100) at org.junit.runners.ParentRunner.runLeaf(ParentRunner.java:366) at org.junit.runners.BlockJUnit4ClassRunner.runChild(BlockJUnit4ClassRunner.java:103) at org.junit.runners.BlockJUnit4ClassRunner.runChild(BlockJUnit4ClassRunner.java:63) at org.junit.runners.ParentRunner$4.run(ParentRunner.java:331) at org.junit.runners.ParentRunner$1.schedule(ParentRunner.java:79) at org.junit.runners.ParentRunner.runChildren(ParentRunner.java:329) at org.junit.runners.ParentRunner.access$100(ParentRunner.java:66) at org.junit.runners.ParentRunner$2.evaluate(ParentRunner.java:293) at org.junit.internal.runners.statements.RunBefores.evaluate(RunBefores.java:26) ... 17 more Caused by: io.mockk.proxy.MockKAgentException: MockK failed to inject the AndroidMockKDispatcher class into the bootstrap class loader It seems like your current VM does not support the jvmti API correctly. at io.mockk.proxy.android.AndroidMockKAgentFactory.init(AndroidMockKAgentFactory.kt:68) at io.mockk.impl.JvmMockKGateway.<init>(JvmMockKGateway.kt:82) at io.mockk.impl.JvmMockKGateway.<clinit>(JvmMockKGateway.kt:230) ... 36 more Caused by: java.lang.ClassNotFoundException: io.mockk.proxy.android.AndroidMockKDispatcher at java.lang.Class.classForName(Native Method) at java.lang.Class.forName(Class.java:454) at io.mockk.proxy.android.AndroidMockKAgentFactory.init(AndroidMockKAgentFactory.kt:62) ... 38 more Caused by: java.lang.ClassNotFoundException: io.mockk.proxy.android.AndroidMockKDispatcher at java.lang.Class.classForName(Native Method) at java.lang.BootClassLoader.findClass(ClassLoader.java:1358) at java.lang.BootClassLoader.loadClass(ClassLoader.java:1418) at java.lang.ClassLoader.loadClass(ClassLoader.java:312) ... 41 more Caused by: java.lang.NoClassDefFoundError: Class not found using the boot class loader; no stack trace available
request_completed
java.lang.NoClassDefFoundError: io.mockk.impl.JvmMockKGateway at com.nextcloud.client.files.download.RegistryTest$Base.setUpBase(RegistryTest.kt:523) ... 40 trimmed Caused by: java.lang.ExceptionInInitializerError at com.nextcloud.client.documentscan.GeneratePDFUseCaseTest.setUp(GeneratePDFUseCaseTest.kt:80) at java.lang.reflect.Method.invoke(Native Method) at org.junit.runners.model.FrameworkMethod$1.runReflectiveCall(FrameworkMethod.java:59) at org.junit.internal.runners.model.ReflectiveCallable.run(ReflectiveCallable.java:12) at org.junit.runners.model.FrameworkMethod.invokeExplosively(FrameworkMethod.java:56) at androidx.test.internal.runner.junit4.statement.RunBefores.evaluate(RunBefores.java:76) at androidx.test.internal.runner.junit4.statement.RunAfters.evaluate(RunAfters.java:61) at androidx.test.rule.GrantPermissionRule$RequestPermissionStatement.evaluate(GrantPermissionRule.java:150) at org.junit.runners.ParentRunner$3.evaluate(ParentRunner.java:306) at org.junit.runners.BlockJUnit4ClassRunner$1.evaluate(BlockJUnit4ClassRunner.java:100) at org.junit.runners.ParentRunner.runLeaf(ParentRunner.java:366) at org.junit.runners.BlockJUnit4ClassRunner.runChild(BlockJUnit4ClassRunner.java:103) at org.junit.runners.BlockJUnit4ClassRunner.runChild(BlockJUnit4ClassRunner.java:63) at org.junit.runners.ParentRunner$4.run(ParentRunner.java:331) at org.junit.runners.ParentRunner$1.schedule(ParentRunner.java:79) at org.junit.runners.ParentRunner.runChildren(ParentRunner.java:329) at org.junit.runners.ParentRunner.access$100(ParentRunner.java:66) at org.junit.runners.ParentRunner$2.evaluate(ParentRunner.java:293) at org.junit.internal.runners.statements.RunBefores.evaluate(RunBefores.java:26) ... 17 more Caused by: io.mockk.proxy.MockKAgentException: MockK failed to inject the AndroidMockKDispatcher class into the bootstrap class loader It seems like your current VM does not support the jvmti API correctly. at io.mockk.proxy.android.AndroidMockKAgentFactory.init(AndroidMockKAgentFactory.kt:68) at io.mockk.impl.JvmMockKGateway.<init>(JvmMockKGateway.kt:82) at io.mockk.impl.JvmMockKGateway.<clinit>(JvmMockKGateway.kt:230) ... 36 more Caused by: java.lang.ClassNotFoundException: io.mockk.proxy.android.AndroidMockKDispatcher at java.lang.Class.classForName(Native Method) at java.lang.Class.forName(Class.java:454) at io.mockk.proxy.android.AndroidMockKAgentFactory.init(AndroidMockKAgentFactory.kt:62) ... 38 more Caused by: java.lang.ClassNotFoundException: io.mockk.proxy.android.AndroidMockKDispatcher at java.lang.Class.classForName(Native Method) at java.lang.BootClassLoader.findClass(ClassLoader.java:1358) at java.lang.BootClassLoader.loadClass(ClassLoader.java:1418) at java.lang.ClassLoader.loadClass(ClassLoader.java:312) ... 41 more Caused by: java.lang.NoClassDefFoundError: Class not found using the boot class loader; no stack trace available
request_pending
java.lang.NoClassDefFoundError: io.mockk.impl.JvmMockKGateway at com.nextcloud.client.files.download.RegistryTest$Base.setUpBase(RegistryTest.kt:523) ... 40 trimmed Caused by: java.lang.ExceptionInInitializerError at com.nextcloud.client.documentscan.GeneratePDFUseCaseTest.setUp(GeneratePDFUseCaseTest.kt:80) at java.lang.reflect.Method.invoke(Native Method) at org.junit.runners.model.FrameworkMethod$1.runReflectiveCall(FrameworkMethod.java:59) at org.junit.internal.runners.model.ReflectiveCallable.run(ReflectiveCallable.java:12) at org.junit.runners.model.FrameworkMethod.invokeExplosively(FrameworkMethod.java:56) at androidx.test.internal.runner.junit4.statement.RunBefores.evaluate(RunBefores.java:76) at androidx.test.internal.runner.junit4.statement.RunAfters.evaluate(RunAfters.java:61) at androidx.test.rule.GrantPermissionRule$RequestPermissionStatement.evaluate(GrantPermissionRule.java:150) at org.junit.runners.ParentRunner$3.evaluate(ParentRunner.java:306) at org.junit.runners.BlockJUnit4ClassRunner$1.evaluate(BlockJUnit4ClassRunner.java:100) at org.junit.runners.ParentRunner.runLeaf(ParentRunner.java:366) at org.junit.runners.BlockJUnit4ClassRunner.runChild(BlockJUnit4ClassRunner.java:103) at org.junit.runners.BlockJUnit4ClassRunner.runChild(BlockJUnit4ClassRunner.java:63) at org.junit.runners.ParentRunner$4.run(ParentRunner.java:331) at org.junit.runners.ParentRunner$1.schedule(ParentRunner.java:79) at org.junit.runners.ParentRunner.runChildren(ParentRunner.java:329) at org.junit.runners.ParentRunner.access$100(ParentRunner.java:66) at org.junit.runners.ParentRunner$2.evaluate(ParentRunner.java:293) at org.junit.internal.runners.statements.RunBefores.evaluate(RunBefores.java:26) ... 17 more Caused by: io.mockk.proxy.MockKAgentException: MockK failed to inject the AndroidMockKDispatcher class into the bootstrap class loader It seems like your current VM does not support the jvmti API correctly. at io.mockk.proxy.android.AndroidMockKAgentFactory.init(AndroidMockKAgentFactory.kt:68) at io.mockk.impl.JvmMockKGateway.<init>(JvmMockKGateway.kt:82) at io.mockk.impl.JvmMockKGateway.<clinit>(JvmMockKGateway.kt:230) ... 36 more Caused by: java.lang.ClassNotFoundException: io.mockk.proxy.android.AndroidMockKDispatcher at java.lang.Class.classForName(Native Method) at java.lang.Class.forName(Class.java:454) at io.mockk.proxy.android.AndroidMockKAgentFactory.init(AndroidMockKAgentFactory.kt:62) ... 38 more Caused by: java.lang.ClassNotFoundException: io.mockk.proxy.android.AndroidMockKDispatcher at java.lang.Class.classForName(Native Method) at java.lang.BootClassLoader.findClass(ClassLoader.java:1358) at java.lang.BootClassLoader.loadClass(ClassLoader.java:1418) at java.lang.ClassLoader.loadClass(ClassLoader.java:312) ... 41 more Caused by: java.lang.NoClassDefFoundError: Class not found using the boot class loader; no stack trace available
request_running
java.lang.NoClassDefFoundError: io.mockk.impl.JvmMockKGateway at com.nextcloud.client.files.download.RegistryTest$Base.setUpBase(RegistryTest.kt:523) ... 40 trimmed Caused by: java.lang.ExceptionInInitializerError at com.nextcloud.client.documentscan.GeneratePDFUseCaseTest.setUp(GeneratePDFUseCaseTest.kt:80) at java.lang.reflect.Method.invoke(Native Method) at org.junit.runners.model.FrameworkMethod$1.runReflectiveCall(FrameworkMethod.java:59) at org.junit.internal.runners.model.ReflectiveCallable.run(ReflectiveCallable.java:12) at org.junit.runners.model.FrameworkMethod.invokeExplosively(FrameworkMethod.java:56) at androidx.test.internal.runner.junit4.statement.RunBefores.evaluate(RunBefores.java:76) at androidx.test.internal.runner.junit4.statement.RunAfters.evaluate(RunAfters.java:61) at androidx.test.rule.GrantPermissionRule$RequestPermissionStatement.evaluate(GrantPermissionRule.java:150) at org.junit.runners.ParentRunner$3.evaluate(ParentRunner.java:306) at org.junit.runners.BlockJUnit4ClassRunner$1.evaluate(BlockJUnit4ClassRunner.java:100) at org.junit.runners.ParentRunner.runLeaf(ParentRunner.java:366) at org.junit.runners.BlockJUnit4ClassRunner.runChild(BlockJUnit4ClassRunner.java:103) at org.junit.runners.BlockJUnit4ClassRunner.runChild(BlockJUnit4ClassRunner.java:63) at org.junit.runners.ParentRunner$4.run(ParentRunner.java:331) at org.junit.runners.ParentRunner$1.schedule(ParentRunner.java:79) at org.junit.runners.ParentRunner.runChildren(ParentRunner.java:329) at org.junit.runners.ParentRunner.access$100(ParentRunner.java:66) at org.junit.runners.ParentRunner$2.evaluate(ParentRunner.java:293) at org.junit.internal.runners.statements.RunBefores.evaluate(RunBefores.java:26) ... 17 more Caused by: io.mockk.proxy.MockKAgentException: MockK failed to inject the AndroidMockKDispatcher class into the bootstrap class loader It seems like your current VM does not support the jvmti API correctly. at io.mockk.proxy.android.AndroidMockKAgentFactory.init(AndroidMockKAgentFactory.kt:68) at io.mockk.impl.JvmMockKGateway.<init>(JvmMockKGateway.kt:82) at io.mockk.impl.JvmMockKGateway.<clinit>(JvmMockKGateway.kt:230) ... 36 more Caused by: java.lang.ClassNotFoundException: io.mockk.proxy.android.AndroidMockKDispatcher at java.lang.Class.classForName(Native Method) at java.lang.Class.forName(Class.java:454) at io.mockk.proxy.android.AndroidMockKAgentFactory.init(AndroidMockKAgentFactory.kt:62) ... 38 more Caused by: java.lang.ClassNotFoundException: io.mockk.proxy.android.AndroidMockKDispatcher at java.lang.Class.classForName(Native Method) at java.lang.BootClassLoader.findClass(ClassLoader.java:1358) at java.lang.BootClassLoader.loadClass(ClassLoader.java:1418) at java.lang.ClassLoader.loadClass(ClassLoader.java:312) ... 41 more Caused by: java.lang.NoClassDefFoundError: Class not found using the boot class loader; no stack trace available
Tests
| Test | emulator-5554 |
|---|---|
| no_requests | failed (0.001s) |
| request_completed | failed (0.006s) |
| request_pending | failed (0.004s) |
| request_running | failed (0.011s) |