Class com.nextcloud.client.files.download.RegistryTest$GetTransfers

8

tests

8

failures

0

skipped

0.024s

duration

0%

successful

Failed tests

get_by_id_searches_completed_queue

java.lang.NoClassDefFoundError: io.mockk.impl.JvmMockKGateway
	at com.nextcloud.client.files.download.RegistryTest$Base.setUpBase(RegistryTest.kt:523)
	... 40 trimmed
Caused by: java.lang.ExceptionInInitializerError
	at com.nextcloud.client.documentscan.GeneratePDFUseCaseTest.setUp(GeneratePDFUseCaseTest.kt:80)
	at java.lang.reflect.Method.invoke(Native Method)
	at org.junit.runners.model.FrameworkMethod$1.runReflectiveCall(FrameworkMethod.java:59)
	at org.junit.internal.runners.model.ReflectiveCallable.run(ReflectiveCallable.java:12)
	at org.junit.runners.model.FrameworkMethod.invokeExplosively(FrameworkMethod.java:56)
	at androidx.test.internal.runner.junit4.statement.RunBefores.evaluate(RunBefores.java:76)
	at androidx.test.internal.runner.junit4.statement.RunAfters.evaluate(RunAfters.java:61)
	at androidx.test.rule.GrantPermissionRule$RequestPermissionStatement.evaluate(GrantPermissionRule.java:150)
	at org.junit.runners.ParentRunner$3.evaluate(ParentRunner.java:306)
	at org.junit.runners.BlockJUnit4ClassRunner$1.evaluate(BlockJUnit4ClassRunner.java:100)
	at org.junit.runners.ParentRunner.runLeaf(ParentRunner.java:366)
	at org.junit.runners.BlockJUnit4ClassRunner.runChild(BlockJUnit4ClassRunner.java:103)
	at org.junit.runners.BlockJUnit4ClassRunner.runChild(BlockJUnit4ClassRunner.java:63)
	at org.junit.runners.ParentRunner$4.run(ParentRunner.java:331)
	at org.junit.runners.ParentRunner$1.schedule(ParentRunner.java:79)
	at org.junit.runners.ParentRunner.runChildren(ParentRunner.java:329)
	at org.junit.runners.ParentRunner.access$100(ParentRunner.java:66)
	at org.junit.runners.ParentRunner$2.evaluate(ParentRunner.java:293)
	at org.junit.internal.runners.statements.RunBefores.evaluate(RunBefores.java:26)
	... 17 more
Caused by: io.mockk.proxy.MockKAgentException: MockK failed to inject the AndroidMockKDispatcher class into the bootstrap class loader

It seems like your current VM does not support the jvmti API correctly.
	at io.mockk.proxy.android.AndroidMockKAgentFactory.init(AndroidMockKAgentFactory.kt:68)
	at io.mockk.impl.JvmMockKGateway.<init>(JvmMockKGateway.kt:82)
	at io.mockk.impl.JvmMockKGateway.<clinit>(JvmMockKGateway.kt:230)
	... 36 more
Caused by: java.lang.ClassNotFoundException: io.mockk.proxy.android.AndroidMockKDispatcher
	at java.lang.Class.classForName(Native Method)
	at java.lang.Class.forName(Class.java:454)
	at io.mockk.proxy.android.AndroidMockKAgentFactory.init(AndroidMockKAgentFactory.kt:62)
	... 38 more
Caused by: java.lang.ClassNotFoundException: io.mockk.proxy.android.AndroidMockKDispatcher
	at java.lang.Class.classForName(Native Method)
	at java.lang.BootClassLoader.findClass(ClassLoader.java:1358)
	at java.lang.BootClassLoader.loadClass(ClassLoader.java:1418)
	at java.lang.ClassLoader.loadClass(ClassLoader.java:312)
	... 41 more
Caused by: java.lang.NoClassDefFoundError: Class not found using the boot class loader; no stack trace available

get_by_id_searches_pending_queue

java.lang.NoClassDefFoundError: io.mockk.impl.JvmMockKGateway
	at com.nextcloud.client.files.download.RegistryTest$Base.setUpBase(RegistryTest.kt:523)
	... 40 trimmed
Caused by: java.lang.ExceptionInInitializerError
	at com.nextcloud.client.documentscan.GeneratePDFUseCaseTest.setUp(GeneratePDFUseCaseTest.kt:80)
	at java.lang.reflect.Method.invoke(Native Method)
	at org.junit.runners.model.FrameworkMethod$1.runReflectiveCall(FrameworkMethod.java:59)
	at org.junit.internal.runners.model.ReflectiveCallable.run(ReflectiveCallable.java:12)
	at org.junit.runners.model.FrameworkMethod.invokeExplosively(FrameworkMethod.java:56)
	at androidx.test.internal.runner.junit4.statement.RunBefores.evaluate(RunBefores.java:76)
	at androidx.test.internal.runner.junit4.statement.RunAfters.evaluate(RunAfters.java:61)
	at androidx.test.rule.GrantPermissionRule$RequestPermissionStatement.evaluate(GrantPermissionRule.java:150)
	at org.junit.runners.ParentRunner$3.evaluate(ParentRunner.java:306)
	at org.junit.runners.BlockJUnit4ClassRunner$1.evaluate(BlockJUnit4ClassRunner.java:100)
	at org.junit.runners.ParentRunner.runLeaf(ParentRunner.java:366)
	at org.junit.runners.BlockJUnit4ClassRunner.runChild(BlockJUnit4ClassRunner.java:103)
	at org.junit.runners.BlockJUnit4ClassRunner.runChild(BlockJUnit4ClassRunner.java:63)
	at org.junit.runners.ParentRunner$4.run(ParentRunner.java:331)
	at org.junit.runners.ParentRunner$1.schedule(ParentRunner.java:79)
	at org.junit.runners.ParentRunner.runChildren(ParentRunner.java:329)
	at org.junit.runners.ParentRunner.access$100(ParentRunner.java:66)
	at org.junit.runners.ParentRunner$2.evaluate(ParentRunner.java:293)
	at org.junit.internal.runners.statements.RunBefores.evaluate(RunBefores.java:26)
	... 17 more
Caused by: io.mockk.proxy.MockKAgentException: MockK failed to inject the AndroidMockKDispatcher class into the bootstrap class loader

It seems like your current VM does not support the jvmti API correctly.
	at io.mockk.proxy.android.AndroidMockKAgentFactory.init(AndroidMockKAgentFactory.kt:68)
	at io.mockk.impl.JvmMockKGateway.<init>(JvmMockKGateway.kt:82)
	at io.mockk.impl.JvmMockKGateway.<clinit>(JvmMockKGateway.kt:230)
	... 36 more
Caused by: java.lang.ClassNotFoundException: io.mockk.proxy.android.AndroidMockKDispatcher
	at java.lang.Class.classForName(Native Method)
	at java.lang.Class.forName(Class.java:454)
	at io.mockk.proxy.android.AndroidMockKAgentFactory.init(AndroidMockKAgentFactory.kt:62)
	... 38 more
Caused by: java.lang.ClassNotFoundException: io.mockk.proxy.android.AndroidMockKDispatcher
	at java.lang.Class.classForName(Native Method)
	at java.lang.BootClassLoader.findClass(ClassLoader.java:1358)
	at java.lang.BootClassLoader.loadClass(ClassLoader.java:1418)
	at java.lang.ClassLoader.loadClass(ClassLoader.java:312)
	... 41 more
Caused by: java.lang.NoClassDefFoundError: Class not found using the boot class loader; no stack trace available

get_by_id_searches_running_queue

java.lang.NoClassDefFoundError: io.mockk.impl.JvmMockKGateway
	at com.nextcloud.client.files.download.RegistryTest$Base.setUpBase(RegistryTest.kt:523)
	... 40 trimmed
Caused by: java.lang.ExceptionInInitializerError
	at com.nextcloud.client.documentscan.GeneratePDFUseCaseTest.setUp(GeneratePDFUseCaseTest.kt:80)
	at java.lang.reflect.Method.invoke(Native Method)
	at org.junit.runners.model.FrameworkMethod$1.runReflectiveCall(FrameworkMethod.java:59)
	at org.junit.internal.runners.model.ReflectiveCallable.run(ReflectiveCallable.java:12)
	at org.junit.runners.model.FrameworkMethod.invokeExplosively(FrameworkMethod.java:56)
	at androidx.test.internal.runner.junit4.statement.RunBefores.evaluate(RunBefores.java:76)
	at androidx.test.internal.runner.junit4.statement.RunAfters.evaluate(RunAfters.java:61)
	at androidx.test.rule.GrantPermissionRule$RequestPermissionStatement.evaluate(GrantPermissionRule.java:150)
	at org.junit.runners.ParentRunner$3.evaluate(ParentRunner.java:306)
	at org.junit.runners.BlockJUnit4ClassRunner$1.evaluate(BlockJUnit4ClassRunner.java:100)
	at org.junit.runners.ParentRunner.runLeaf(ParentRunner.java:366)
	at org.junit.runners.BlockJUnit4ClassRunner.runChild(BlockJUnit4ClassRunner.java:103)
	at org.junit.runners.BlockJUnit4ClassRunner.runChild(BlockJUnit4ClassRunner.java:63)
	at org.junit.runners.ParentRunner$4.run(ParentRunner.java:331)
	at org.junit.runners.ParentRunner$1.schedule(ParentRunner.java:79)
	at org.junit.runners.ParentRunner.runChildren(ParentRunner.java:329)
	at org.junit.runners.ParentRunner.access$100(ParentRunner.java:66)
	at org.junit.runners.ParentRunner$2.evaluate(ParentRunner.java:293)
	at org.junit.internal.runners.statements.RunBefores.evaluate(RunBefores.java:26)
	... 17 more
Caused by: io.mockk.proxy.MockKAgentException: MockK failed to inject the AndroidMockKDispatcher class into the bootstrap class loader

It seems like your current VM does not support the jvmti API correctly.
	at io.mockk.proxy.android.AndroidMockKAgentFactory.init(AndroidMockKAgentFactory.kt:68)
	at io.mockk.impl.JvmMockKGateway.<init>(JvmMockKGateway.kt:82)
	at io.mockk.impl.JvmMockKGateway.<clinit>(JvmMockKGateway.kt:230)
	... 36 more
Caused by: java.lang.ClassNotFoundException: io.mockk.proxy.android.AndroidMockKDispatcher
	at java.lang.Class.classForName(Native Method)
	at java.lang.Class.forName(Class.java:454)
	at io.mockk.proxy.android.AndroidMockKAgentFactory.init(AndroidMockKAgentFactory.kt:62)
	... 38 more
Caused by: java.lang.ClassNotFoundException: io.mockk.proxy.android.AndroidMockKDispatcher
	at java.lang.Class.classForName(Native Method)
	at java.lang.BootClassLoader.findClass(ClassLoader.java:1358)
	at java.lang.BootClassLoader.loadClass(ClassLoader.java:1418)
	at java.lang.ClassLoader.loadClass(ClassLoader.java:312)
	... 41 more
Caused by: java.lang.NoClassDefFoundError: Class not found using the boot class loader; no stack trace available

get_by_path_searches_completed_queue

java.lang.NoClassDefFoundError: io.mockk.impl.JvmMockKGateway
	at com.nextcloud.client.files.download.RegistryTest$Base.setUpBase(RegistryTest.kt:523)
	... 40 trimmed
Caused by: java.lang.ExceptionInInitializerError
	at com.nextcloud.client.documentscan.GeneratePDFUseCaseTest.setUp(GeneratePDFUseCaseTest.kt:80)
	at java.lang.reflect.Method.invoke(Native Method)
	at org.junit.runners.model.FrameworkMethod$1.runReflectiveCall(FrameworkMethod.java:59)
	at org.junit.internal.runners.model.ReflectiveCallable.run(ReflectiveCallable.java:12)
	at org.junit.runners.model.FrameworkMethod.invokeExplosively(FrameworkMethod.java:56)
	at androidx.test.internal.runner.junit4.statement.RunBefores.evaluate(RunBefores.java:76)
	at androidx.test.internal.runner.junit4.statement.RunAfters.evaluate(RunAfters.java:61)
	at androidx.test.rule.GrantPermissionRule$RequestPermissionStatement.evaluate(GrantPermissionRule.java:150)
	at org.junit.runners.ParentRunner$3.evaluate(ParentRunner.java:306)
	at org.junit.runners.BlockJUnit4ClassRunner$1.evaluate(BlockJUnit4ClassRunner.java:100)
	at org.junit.runners.ParentRunner.runLeaf(ParentRunner.java:366)
	at org.junit.runners.BlockJUnit4ClassRunner.runChild(BlockJUnit4ClassRunner.java:103)
	at org.junit.runners.BlockJUnit4ClassRunner.runChild(BlockJUnit4ClassRunner.java:63)
	at org.junit.runners.ParentRunner$4.run(ParentRunner.java:331)
	at org.junit.runners.ParentRunner$1.schedule(ParentRunner.java:79)
	at org.junit.runners.ParentRunner.runChildren(ParentRunner.java:329)
	at org.junit.runners.ParentRunner.access$100(ParentRunner.java:66)
	at org.junit.runners.ParentRunner$2.evaluate(ParentRunner.java:293)
	at org.junit.internal.runners.statements.RunBefores.evaluate(RunBefores.java:26)
	... 17 more
Caused by: io.mockk.proxy.MockKAgentException: MockK failed to inject the AndroidMockKDispatcher class into the bootstrap class loader

It seems like your current VM does not support the jvmti API correctly.
	at io.mockk.proxy.android.AndroidMockKAgentFactory.init(AndroidMockKAgentFactory.kt:68)
	at io.mockk.impl.JvmMockKGateway.<init>(JvmMockKGateway.kt:82)
	at io.mockk.impl.JvmMockKGateway.<clinit>(JvmMockKGateway.kt:230)
	... 36 more
Caused by: java.lang.ClassNotFoundException: io.mockk.proxy.android.AndroidMockKDispatcher
	at java.lang.Class.classForName(Native Method)
	at java.lang.Class.forName(Class.java:454)
	at io.mockk.proxy.android.AndroidMockKAgentFactory.init(AndroidMockKAgentFactory.kt:62)
	... 38 more
Caused by: java.lang.ClassNotFoundException: io.mockk.proxy.android.AndroidMockKDispatcher
	at java.lang.Class.classForName(Native Method)
	at java.lang.BootClassLoader.findClass(ClassLoader.java:1358)
	at java.lang.BootClassLoader.loadClass(ClassLoader.java:1418)
	at java.lang.ClassLoader.loadClass(ClassLoader.java:312)
	... 41 more
Caused by: java.lang.NoClassDefFoundError: Class not found using the boot class loader; no stack trace available

get_by_path_searches_pending_queue

java.lang.NoClassDefFoundError: io.mockk.impl.JvmMockKGateway
	at com.nextcloud.client.files.download.RegistryTest$Base.setUpBase(RegistryTest.kt:523)
	... 40 trimmed
Caused by: java.lang.ExceptionInInitializerError
	at com.nextcloud.client.documentscan.GeneratePDFUseCaseTest.setUp(GeneratePDFUseCaseTest.kt:80)
	at java.lang.reflect.Method.invoke(Native Method)
	at org.junit.runners.model.FrameworkMethod$1.runReflectiveCall(FrameworkMethod.java:59)
	at org.junit.internal.runners.model.ReflectiveCallable.run(ReflectiveCallable.java:12)
	at org.junit.runners.model.FrameworkMethod.invokeExplosively(FrameworkMethod.java:56)
	at androidx.test.internal.runner.junit4.statement.RunBefores.evaluate(RunBefores.java:76)
	at androidx.test.internal.runner.junit4.statement.RunAfters.evaluate(RunAfters.java:61)
	at androidx.test.rule.GrantPermissionRule$RequestPermissionStatement.evaluate(GrantPermissionRule.java:150)
	at org.junit.runners.ParentRunner$3.evaluate(ParentRunner.java:306)
	at org.junit.runners.BlockJUnit4ClassRunner$1.evaluate(BlockJUnit4ClassRunner.java:100)
	at org.junit.runners.ParentRunner.runLeaf(ParentRunner.java:366)
	at org.junit.runners.BlockJUnit4ClassRunner.runChild(BlockJUnit4ClassRunner.java:103)
	at org.junit.runners.BlockJUnit4ClassRunner.runChild(BlockJUnit4ClassRunner.java:63)
	at org.junit.runners.ParentRunner$4.run(ParentRunner.java:331)
	at org.junit.runners.ParentRunner$1.schedule(ParentRunner.java:79)
	at org.junit.runners.ParentRunner.runChildren(ParentRunner.java:329)
	at org.junit.runners.ParentRunner.access$100(ParentRunner.java:66)
	at org.junit.runners.ParentRunner$2.evaluate(ParentRunner.java:293)
	at org.junit.internal.runners.statements.RunBefores.evaluate(RunBefores.java:26)
	... 17 more
Caused by: io.mockk.proxy.MockKAgentException: MockK failed to inject the AndroidMockKDispatcher class into the bootstrap class loader

It seems like your current VM does not support the jvmti API correctly.
	at io.mockk.proxy.android.AndroidMockKAgentFactory.init(AndroidMockKAgentFactory.kt:68)
	at io.mockk.impl.JvmMockKGateway.<init>(JvmMockKGateway.kt:82)
	at io.mockk.impl.JvmMockKGateway.<clinit>(JvmMockKGateway.kt:230)
	... 36 more
Caused by: java.lang.ClassNotFoundException: io.mockk.proxy.android.AndroidMockKDispatcher
	at java.lang.Class.classForName(Native Method)
	at java.lang.Class.forName(Class.java:454)
	at io.mockk.proxy.android.AndroidMockKAgentFactory.init(AndroidMockKAgentFactory.kt:62)
	... 38 more
Caused by: java.lang.ClassNotFoundException: io.mockk.proxy.android.AndroidMockKDispatcher
	at java.lang.Class.classForName(Native Method)
	at java.lang.BootClassLoader.findClass(ClassLoader.java:1358)
	at java.lang.BootClassLoader.loadClass(ClassLoader.java:1418)
	at java.lang.ClassLoader.loadClass(ClassLoader.java:312)
	... 41 more
Caused by: java.lang.NoClassDefFoundError: Class not found using the boot class loader; no stack trace available

get_by_path_searches_running_queue

java.lang.NoClassDefFoundError: io.mockk.impl.JvmMockKGateway
	at com.nextcloud.client.files.download.RegistryTest$Base.setUpBase(RegistryTest.kt:523)
	... 40 trimmed
Caused by: java.lang.ExceptionInInitializerError
	at com.nextcloud.client.documentscan.GeneratePDFUseCaseTest.setUp(GeneratePDFUseCaseTest.kt:80)
	at java.lang.reflect.Method.invoke(Native Method)
	at org.junit.runners.model.FrameworkMethod$1.runReflectiveCall(FrameworkMethod.java:59)
	at org.junit.internal.runners.model.ReflectiveCallable.run(ReflectiveCallable.java:12)
	at org.junit.runners.model.FrameworkMethod.invokeExplosively(FrameworkMethod.java:56)
	at androidx.test.internal.runner.junit4.statement.RunBefores.evaluate(RunBefores.java:76)
	at androidx.test.internal.runner.junit4.statement.RunAfters.evaluate(RunAfters.java:61)
	at androidx.test.rule.GrantPermissionRule$RequestPermissionStatement.evaluate(GrantPermissionRule.java:150)
	at org.junit.runners.ParentRunner$3.evaluate(ParentRunner.java:306)
	at org.junit.runners.BlockJUnit4ClassRunner$1.evaluate(BlockJUnit4ClassRunner.java:100)
	at org.junit.runners.ParentRunner.runLeaf(ParentRunner.java:366)
	at org.junit.runners.BlockJUnit4ClassRunner.runChild(BlockJUnit4ClassRunner.java:103)
	at org.junit.runners.BlockJUnit4ClassRunner.runChild(BlockJUnit4ClassRunner.java:63)
	at org.junit.runners.ParentRunner$4.run(ParentRunner.java:331)
	at org.junit.runners.ParentRunner$1.schedule(ParentRunner.java:79)
	at org.junit.runners.ParentRunner.runChildren(ParentRunner.java:329)
	at org.junit.runners.ParentRunner.access$100(ParentRunner.java:66)
	at org.junit.runners.ParentRunner$2.evaluate(ParentRunner.java:293)
	at org.junit.internal.runners.statements.RunBefores.evaluate(RunBefores.java:26)
	... 17 more
Caused by: io.mockk.proxy.MockKAgentException: MockK failed to inject the AndroidMockKDispatcher class into the bootstrap class loader

It seems like your current VM does not support the jvmti API correctly.
	at io.mockk.proxy.android.AndroidMockKAgentFactory.init(AndroidMockKAgentFactory.kt:68)
	at io.mockk.impl.JvmMockKGateway.<init>(JvmMockKGateway.kt:82)
	at io.mockk.impl.JvmMockKGateway.<clinit>(JvmMockKGateway.kt:230)
	... 36 more
Caused by: java.lang.ClassNotFoundException: io.mockk.proxy.android.AndroidMockKDispatcher
	at java.lang.Class.classForName(Native Method)
	at java.lang.Class.forName(Class.java:454)
	at io.mockk.proxy.android.AndroidMockKAgentFactory.init(AndroidMockKAgentFactory.kt:62)
	... 38 more
Caused by: java.lang.ClassNotFoundException: io.mockk.proxy.android.AndroidMockKDispatcher
	at java.lang.Class.classForName(Native Method)
	at java.lang.BootClassLoader.findClass(ClassLoader.java:1358)
	at java.lang.BootClassLoader.loadClass(ClassLoader.java:1418)
	at java.lang.ClassLoader.loadClass(ClassLoader.java:312)
	... 41 more
Caused by: java.lang.NoClassDefFoundError: Class not found using the boot class loader; no stack trace available

not_found_by_id

java.lang.NoClassDefFoundError: io.mockk.impl.JvmMockKGateway
	at com.nextcloud.client.files.download.RegistryTest$Base.setUpBase(RegistryTest.kt:523)
	... 40 trimmed
Caused by: java.lang.ExceptionInInitializerError
	at com.nextcloud.client.documentscan.GeneratePDFUseCaseTest.setUp(GeneratePDFUseCaseTest.kt:80)
	at java.lang.reflect.Method.invoke(Native Method)
	at org.junit.runners.model.FrameworkMethod$1.runReflectiveCall(FrameworkMethod.java:59)
	at org.junit.internal.runners.model.ReflectiveCallable.run(ReflectiveCallable.java:12)
	at org.junit.runners.model.FrameworkMethod.invokeExplosively(FrameworkMethod.java:56)
	at androidx.test.internal.runner.junit4.statement.RunBefores.evaluate(RunBefores.java:76)
	at androidx.test.internal.runner.junit4.statement.RunAfters.evaluate(RunAfters.java:61)
	at androidx.test.rule.GrantPermissionRule$RequestPermissionStatement.evaluate(GrantPermissionRule.java:150)
	at org.junit.runners.ParentRunner$3.evaluate(ParentRunner.java:306)
	at org.junit.runners.BlockJUnit4ClassRunner$1.evaluate(BlockJUnit4ClassRunner.java:100)
	at org.junit.runners.ParentRunner.runLeaf(ParentRunner.java:366)
	at org.junit.runners.BlockJUnit4ClassRunner.runChild(BlockJUnit4ClassRunner.java:103)
	at org.junit.runners.BlockJUnit4ClassRunner.runChild(BlockJUnit4ClassRunner.java:63)
	at org.junit.runners.ParentRunner$4.run(ParentRunner.java:331)
	at org.junit.runners.ParentRunner$1.schedule(ParentRunner.java:79)
	at org.junit.runners.ParentRunner.runChildren(ParentRunner.java:329)
	at org.junit.runners.ParentRunner.access$100(ParentRunner.java:66)
	at org.junit.runners.ParentRunner$2.evaluate(ParentRunner.java:293)
	at org.junit.internal.runners.statements.RunBefores.evaluate(RunBefores.java:26)
	... 17 more
Caused by: io.mockk.proxy.MockKAgentException: MockK failed to inject the AndroidMockKDispatcher class into the bootstrap class loader

It seems like your current VM does not support the jvmti API correctly.
	at io.mockk.proxy.android.AndroidMockKAgentFactory.init(AndroidMockKAgentFactory.kt:68)
	at io.mockk.impl.JvmMockKGateway.<init>(JvmMockKGateway.kt:82)
	at io.mockk.impl.JvmMockKGateway.<clinit>(JvmMockKGateway.kt:230)
	... 36 more
Caused by: java.lang.ClassNotFoundException: io.mockk.proxy.android.AndroidMockKDispatcher
	at java.lang.Class.classForName(Native Method)
	at java.lang.Class.forName(Class.java:454)
	at io.mockk.proxy.android.AndroidMockKAgentFactory.init(AndroidMockKAgentFactory.kt:62)
	... 38 more
Caused by: java.lang.ClassNotFoundException: io.mockk.proxy.android.AndroidMockKDispatcher
	at java.lang.Class.classForName(Native Method)
	at java.lang.BootClassLoader.findClass(ClassLoader.java:1358)
	at java.lang.BootClassLoader.loadClass(ClassLoader.java:1418)
	at java.lang.ClassLoader.loadClass(ClassLoader.java:312)
	... 41 more
Caused by: java.lang.NoClassDefFoundError: Class not found using the boot class loader; no stack trace available

not_found_by_path

java.lang.NoClassDefFoundError: io.mockk.impl.JvmMockKGateway
	at com.nextcloud.client.files.download.RegistryTest$Base.setUpBase(RegistryTest.kt:523)
	... 40 trimmed
Caused by: java.lang.ExceptionInInitializerError
	at com.nextcloud.client.documentscan.GeneratePDFUseCaseTest.setUp(GeneratePDFUseCaseTest.kt:80)
	at java.lang.reflect.Method.invoke(Native Method)
	at org.junit.runners.model.FrameworkMethod$1.runReflectiveCall(FrameworkMethod.java:59)
	at org.junit.internal.runners.model.ReflectiveCallable.run(ReflectiveCallable.java:12)
	at org.junit.runners.model.FrameworkMethod.invokeExplosively(FrameworkMethod.java:56)
	at androidx.test.internal.runner.junit4.statement.RunBefores.evaluate(RunBefores.java:76)
	at androidx.test.internal.runner.junit4.statement.RunAfters.evaluate(RunAfters.java:61)
	at androidx.test.rule.GrantPermissionRule$RequestPermissionStatement.evaluate(GrantPermissionRule.java:150)
	at org.junit.runners.ParentRunner$3.evaluate(ParentRunner.java:306)
	at org.junit.runners.BlockJUnit4ClassRunner$1.evaluate(BlockJUnit4ClassRunner.java:100)
	at org.junit.runners.ParentRunner.runLeaf(ParentRunner.java:366)
	at org.junit.runners.BlockJUnit4ClassRunner.runChild(BlockJUnit4ClassRunner.java:103)
	at org.junit.runners.BlockJUnit4ClassRunner.runChild(BlockJUnit4ClassRunner.java:63)
	at org.junit.runners.ParentRunner$4.run(ParentRunner.java:331)
	at org.junit.runners.ParentRunner$1.schedule(ParentRunner.java:79)
	at org.junit.runners.ParentRunner.runChildren(ParentRunner.java:329)
	at org.junit.runners.ParentRunner.access$100(ParentRunner.java:66)
	at org.junit.runners.ParentRunner$2.evaluate(ParentRunner.java:293)
	at org.junit.internal.runners.statements.RunBefores.evaluate(RunBefores.java:26)
	... 17 more
Caused by: io.mockk.proxy.MockKAgentException: MockK failed to inject the AndroidMockKDispatcher class into the bootstrap class loader

It seems like your current VM does not support the jvmti API correctly.
	at io.mockk.proxy.android.AndroidMockKAgentFactory.init(AndroidMockKAgentFactory.kt:68)
	at io.mockk.impl.JvmMockKGateway.<init>(JvmMockKGateway.kt:82)
	at io.mockk.impl.JvmMockKGateway.<clinit>(JvmMockKGateway.kt:230)
	... 36 more
Caused by: java.lang.ClassNotFoundException: io.mockk.proxy.android.AndroidMockKDispatcher
	at java.lang.Class.classForName(Native Method)
	at java.lang.Class.forName(Class.java:454)
	at io.mockk.proxy.android.AndroidMockKAgentFactory.init(AndroidMockKAgentFactory.kt:62)
	... 38 more
Caused by: java.lang.ClassNotFoundException: io.mockk.proxy.android.AndroidMockKDispatcher
	at java.lang.Class.classForName(Native Method)
	at java.lang.BootClassLoader.findClass(ClassLoader.java:1358)
	at java.lang.BootClassLoader.loadClass(ClassLoader.java:1418)
	at java.lang.ClassLoader.loadClass(ClassLoader.java:312)
	... 41 more
Caused by: java.lang.NoClassDefFoundError: Class not found using the boot class loader; no stack trace available

Tests

Test emulator-5554
get_by_id_searches_completed_queue failed (0.002s)
get_by_id_searches_pending_queue failed (0s)
get_by_id_searches_running_queue failed (0.004s)
get_by_path_searches_completed_queue failed (0.006s)
get_by_path_searches_pending_queue failed (0.004s)
get_by_path_searches_running_queue failed (0.003s)
not_found_by_id failed (0.004s)
not_found_by_path failed (0.001s)