Class com.nextcloud.client.documentscan.GeneratePDFUseCaseTest

2

tests

2

failures

0

skipped

0.134s

duration

0%

successful

Failed tests

generatePdf_checkPages

java.lang.NoClassDefFoundError: io.mockk.impl.JvmMockKGateway
	at com.nextcloud.client.documentscan.GeneratePDFUseCaseTest.setUp(GeneratePDFUseCaseTest.kt:80)
	... 34 trimmed
Caused by: java.lang.ExceptionInInitializerError
	... 36 more
Caused by: io.mockk.proxy.MockKAgentException: MockK failed to inject the AndroidMockKDispatcher class into the bootstrap class loader

It seems like your current VM does not support the jvmti API correctly.
	at io.mockk.proxy.android.AndroidMockKAgentFactory.init(AndroidMockKAgentFactory.kt:68)
	at io.mockk.impl.JvmMockKGateway.<init>(JvmMockKGateway.kt:82)
	at io.mockk.impl.JvmMockKGateway.<clinit>(JvmMockKGateway.kt:230)
	... 36 more
Caused by: java.lang.ClassNotFoundException: io.mockk.proxy.android.AndroidMockKDispatcher
	at java.lang.Class.classForName(Native Method)
	at java.lang.Class.forName(Class.java:454)
	at io.mockk.proxy.android.AndroidMockKAgentFactory.init(AndroidMockKAgentFactory.kt:62)
	... 38 more
Caused by: java.lang.ClassNotFoundException: io.mockk.proxy.android.AndroidMockKDispatcher
	at java.lang.Class.classForName(Native Method)
	at java.lang.BootClassLoader.findClass(ClassLoader.java:1358)
	at java.lang.BootClassLoader.loadClass(ClassLoader.java:1418)
	at java.lang.ClassLoader.loadClass(ClassLoader.java:312)
	... 41 more
Caused by: java.lang.NoClassDefFoundError: Class not found using the boot class loader; no stack trace available

invalidArguments_shouldReturnFalse

java.lang.ExceptionInInitializerError
	at com.nextcloud.client.documentscan.GeneratePDFUseCaseTest.setUp(GeneratePDFUseCaseTest.kt:80)
	... 34 trimmed
Caused by: io.mockk.proxy.MockKAgentException: MockK failed to inject the AndroidMockKDispatcher class into the bootstrap class loader

It seems like your current VM does not support the jvmti API correctly.
	at io.mockk.proxy.android.AndroidMockKAgentFactory.init(AndroidMockKAgentFactory.kt:68)
	at io.mockk.impl.JvmMockKGateway.<init>(JvmMockKGateway.kt:82)
	at io.mockk.impl.JvmMockKGateway.<clinit>(JvmMockKGateway.kt:230)
	... 36 more
Caused by: java.lang.ClassNotFoundException: io.mockk.proxy.android.AndroidMockKDispatcher
	at java.lang.Class.classForName(Native Method)
	at java.lang.Class.forName(Class.java:454)
	at io.mockk.proxy.android.AndroidMockKAgentFactory.init(AndroidMockKAgentFactory.kt:62)
	... 38 more
Caused by: java.lang.ClassNotFoundException: io.mockk.proxy.android.AndroidMockKDispatcher
	at java.lang.Class.classForName(Native Method)
	at java.lang.BootClassLoader.findClass(ClassLoader.java:1358)
	at java.lang.BootClassLoader.loadClass(ClassLoader.java:1418)
	at java.lang.ClassLoader.loadClass(ClassLoader.java:312)
	... 41 more
Caused by: java.lang.NoClassDefFoundError: Class not found using the boot class loader; no stack trace available

Tests

Test emulator-5554
generatePdf_checkPages failed (0.027s)
invalidArguments_shouldReturnFalse failed (0.107s)