Class com.nextcloud.utils.AutoRenameTests
|
0%
successful |
Failed tests
testE2EEFile
org.junit.AssumptionViolatedException: got: <false>, expected: is <true> at org.junit.Assume.assumeThat(Assume.java:106) at org.junit.Assume.assumeTrue(Assume.java:50) at com.owncloud.android.AbstractIT.testOnlyOnServer(AbstractIT.java:205) at com.nextcloud.utils.AutoRenameTests.setup(AutoRenameTests.kt:31)
testEndInvalidExtension
org.junit.AssumptionViolatedException: got: <false>, expected: is <true> at org.junit.Assume.assumeThat(Assume.java:106) at org.junit.Assume.assumeTrue(Assume.java:50) at com.owncloud.android.AbstractIT.testOnlyOnServer(AbstractIT.java:205) at com.nextcloud.utils.AutoRenameTests.setup(AutoRenameTests.kt:31)
testEndInvalidFolderChar
org.junit.AssumptionViolatedException: got: <false>, expected: is <true> at org.junit.Assume.assumeThat(Assume.java:106) at org.junit.Assume.assumeTrue(Assume.java:50) at com.owncloud.android.AbstractIT.testOnlyOnServer(AbstractIT.java:205) at com.nextcloud.utils.AutoRenameTests.setup(AutoRenameTests.kt:31)
testEndNonPrintableChar
org.junit.AssumptionViolatedException: got: <false>, expected: is <true> at org.junit.Assume.assumeThat(Assume.java:106) at org.junit.Assume.assumeTrue(Assume.java:50) at com.owncloud.android.AbstractIT.testOnlyOnServer(AbstractIT.java:205) at com.nextcloud.utils.AutoRenameTests.setup(AutoRenameTests.kt:31)
testExtensionNonPrintableChar
org.junit.AssumptionViolatedException: got: <false>, expected: is <true> at org.junit.Assume.assumeThat(Assume.java:106) at org.junit.Assume.assumeTrue(Assume.java:50) at com.owncloud.android.AbstractIT.testOnlyOnServer(AbstractIT.java:205) at com.nextcloud.utils.AutoRenameTests.setup(AutoRenameTests.kt:31)
testFolderNameLowercase
org.junit.AssumptionViolatedException: got: <false>, expected: is <true> at org.junit.Assume.assumeThat(Assume.java:106) at org.junit.Assume.assumeTrue(Assume.java:50) at com.owncloud.android.AbstractIT.testOnlyOnServer(AbstractIT.java:205) at com.nextcloud.utils.AutoRenameTests.setup(AutoRenameTests.kt:31)
testInvalidChar
org.junit.AssumptionViolatedException: got: <false>, expected: is <true> at org.junit.Assume.assumeThat(Assume.java:106) at org.junit.Assume.assumeTrue(Assume.java:50) at com.owncloud.android.AbstractIT.testOnlyOnServer(AbstractIT.java:205) at com.nextcloud.utils.AutoRenameTests.setup(AutoRenameTests.kt:31)
testInvalidExtension
org.junit.AssumptionViolatedException: got: <false>, expected: is <true> at org.junit.Assume.assumeThat(Assume.java:106) at org.junit.Assume.assumeTrue(Assume.java:50) at com.owncloud.android.AbstractIT.testOnlyOnServer(AbstractIT.java:205) at com.nextcloud.utils.AutoRenameTests.setup(AutoRenameTests.kt:31)
testMiddleInvalidFolderChar
org.junit.AssumptionViolatedException: got: <false>, expected: is <true> at org.junit.Assume.assumeThat(Assume.java:106) at org.junit.Assume.assumeTrue(Assume.java:50) at com.owncloud.android.AbstractIT.testOnlyOnServer(AbstractIT.java:205) at com.nextcloud.utils.AutoRenameTests.setup(AutoRenameTests.kt:31)
testMiddleNonPrintableChar
org.junit.AssumptionViolatedException: got: <false>, expected: is <true> at org.junit.Assume.assumeThat(Assume.java:106) at org.junit.Assume.assumeTrue(Assume.java:50) at com.owncloud.android.AbstractIT.testOnlyOnServer(AbstractIT.java:205) at com.nextcloud.utils.AutoRenameTests.setup(AutoRenameTests.kt:31)
testMixedInvalidChar
org.junit.AssumptionViolatedException: got: <false>, expected: is <true> at org.junit.Assume.assumeThat(Assume.java:106) at org.junit.Assume.assumeTrue(Assume.java:50) at com.owncloud.android.AbstractIT.testOnlyOnServer(AbstractIT.java:205) at com.nextcloud.utils.AutoRenameTests.setup(AutoRenameTests.kt:31)
testMultipleInvalidChars
org.junit.AssumptionViolatedException: got: <false>, expected: is <true> at org.junit.Assume.assumeThat(Assume.java:106) at org.junit.Assume.assumeTrue(Assume.java:50) at com.owncloud.android.AbstractIT.testOnlyOnServer(AbstractIT.java:205) at com.nextcloud.utils.AutoRenameTests.setup(AutoRenameTests.kt:31)
testRemovingLeadingWhitespace
org.junit.AssumptionViolatedException: got: <false>, expected: is <true> at org.junit.Assume.assumeThat(Assume.java:106) at org.junit.Assume.assumeTrue(Assume.java:50) at com.owncloud.android.AbstractIT.testOnlyOnServer(AbstractIT.java:205) at com.nextcloud.utils.AutoRenameTests.setup(AutoRenameTests.kt:31)
testRemovingTrailingAndLeadingWhitespace
org.junit.AssumptionViolatedException: got: <false>, expected: is <true> at org.junit.Assume.assumeThat(Assume.java:106) at org.junit.Assume.assumeTrue(Assume.java:50) at com.owncloud.android.AbstractIT.testOnlyOnServer(AbstractIT.java:205) at com.nextcloud.utils.AutoRenameTests.setup(AutoRenameTests.kt:31)
testRemovingTrailingWhitespace
org.junit.AssumptionViolatedException: got: <false>, expected: is <true> at org.junit.Assume.assumeThat(Assume.java:106) at org.junit.Assume.assumeTrue(Assume.java:50) at com.owncloud.android.AbstractIT.testOnlyOnServer(AbstractIT.java:205) at com.nextcloud.utils.AutoRenameTests.setup(AutoRenameTests.kt:31)
testRenameExtensionForFile
org.junit.AssumptionViolatedException: got: <false>, expected: is <true> at org.junit.Assume.assumeThat(Assume.java:106) at org.junit.Assume.assumeTrue(Assume.java:50) at com.owncloud.android.AbstractIT.testOnlyOnServer(AbstractIT.java:205) at com.nextcloud.utils.AutoRenameTests.setup(AutoRenameTests.kt:31)
testRenameExtensionForFolder
org.junit.AssumptionViolatedException: got: <false>, expected: is <true> at org.junit.Assume.assumeThat(Assume.java:106) at org.junit.Assume.assumeTrue(Assume.java:50) at com.owncloud.android.AbstractIT.testOnlyOnServer(AbstractIT.java:205) at com.nextcloud.utils.AutoRenameTests.setup(AutoRenameTests.kt:31)
testRenameWithLowercasedFiles
org.junit.AssumptionViolatedException: got: <false>, expected: is <true> at org.junit.Assume.assumeThat(Assume.java:106) at org.junit.Assume.assumeTrue(Assume.java:50) at com.owncloud.android.AbstractIT.testOnlyOnServer(AbstractIT.java:205) at com.nextcloud.utils.AutoRenameTests.setup(AutoRenameTests.kt:31)
testStartEndInvalidExtensions
org.junit.AssumptionViolatedException: got: <false>, expected: is <true> at org.junit.Assume.assumeThat(Assume.java:106) at org.junit.Assume.assumeTrue(Assume.java:50) at com.owncloud.android.AbstractIT.testOnlyOnServer(AbstractIT.java:205) at com.nextcloud.utils.AutoRenameTests.setup(AutoRenameTests.kt:31)
testStartInvalidExtension
org.junit.AssumptionViolatedException: got: <false>, expected: is <true> at org.junit.Assume.assumeThat(Assume.java:106) at org.junit.Assume.assumeTrue(Assume.java:50) at com.owncloud.android.AbstractIT.testOnlyOnServer(AbstractIT.java:205) at com.nextcloud.utils.AutoRenameTests.setup(AutoRenameTests.kt:31)
testStartInvalidFolderChar
org.junit.AssumptionViolatedException: got: <false>, expected: is <true> at org.junit.Assume.assumeThat(Assume.java:106) at org.junit.Assume.assumeTrue(Assume.java:50) at com.owncloud.android.AbstractIT.testOnlyOnServer(AbstractIT.java:205) at com.nextcloud.utils.AutoRenameTests.setup(AutoRenameTests.kt:31)
testStartNonPrintableChar
org.junit.AssumptionViolatedException: got: <false>, expected: is <true> at org.junit.Assume.assumeThat(Assume.java:106) at org.junit.Assume.assumeTrue(Assume.java:50) at com.owncloud.android.AbstractIT.testOnlyOnServer(AbstractIT.java:205) at com.nextcloud.utils.AutoRenameTests.setup(AutoRenameTests.kt:31)
testStartsWithPathSeparator
org.junit.AssumptionViolatedException: got: <false>, expected: is <true> at org.junit.Assume.assumeThat(Assume.java:106) at org.junit.Assume.assumeTrue(Assume.java:50) at com.owncloud.android.AbstractIT.testOnlyOnServer(AbstractIT.java:205) at com.nextcloud.utils.AutoRenameTests.setup(AutoRenameTests.kt:31)
testStartsWithPathSeparatorAndValidFilepath
org.junit.AssumptionViolatedException: got: <false>, expected: is <true> at org.junit.Assume.assumeThat(Assume.java:106) at org.junit.Assume.assumeTrue(Assume.java:50) at com.owncloud.android.AbstractIT.testOnlyOnServer(AbstractIT.java:205) at com.nextcloud.utils.AutoRenameTests.setup(AutoRenameTests.kt:31)
testValidFilename
org.junit.AssumptionViolatedException: got: <false>, expected: is <true> at org.junit.Assume.assumeThat(Assume.java:106) at org.junit.Assume.assumeTrue(Assume.java:50) at com.owncloud.android.AbstractIT.testOnlyOnServer(AbstractIT.java:205) at com.nextcloud.utils.AutoRenameTests.setup(AutoRenameTests.kt:31)
testWCFDisabledOnNextcloud30to31ShouldStillApplyRestrictions
org.junit.AssumptionViolatedException: got: <false>, expected: is <true> at org.junit.Assume.assumeThat(Assume.java:106) at org.junit.Assume.assumeTrue(Assume.java:50) at com.owncloud.android.AbstractIT.testOnlyOnServer(AbstractIT.java:205) at com.nextcloud.utils.AutoRenameTests.setup(AutoRenameTests.kt:31)
testWCFDisabledOnNextcloud32ShouldSkipRestrictions
org.junit.AssumptionViolatedException: got: <false>, expected: is <true> at org.junit.Assume.assumeThat(Assume.java:106) at org.junit.Assume.assumeTrue(Assume.java:50) at com.owncloud.android.AbstractIT.testOnlyOnServer(AbstractIT.java:205) at com.nextcloud.utils.AutoRenameTests.setup(AutoRenameTests.kt:31)
testWCFEnabledOnNextcloud32ShouldApplyRestrictions
org.junit.AssumptionViolatedException: got: <false>, expected: is <true> at org.junit.Assume.assumeThat(Assume.java:106) at org.junit.Assume.assumeTrue(Assume.java:50) at com.owncloud.android.AbstractIT.testOnlyOnServer(AbstractIT.java:205) at com.nextcloud.utils.AutoRenameTests.setup(AutoRenameTests.kt:31)
testWCFOnNextcloudBelow30ShouldSkipRestrictions
org.junit.AssumptionViolatedException: got: <false>, expected: is <true> at org.junit.Assume.assumeThat(Assume.java:106) at org.junit.Assume.assumeTrue(Assume.java:50) at com.owncloud.android.AbstractIT.testOnlyOnServer(AbstractIT.java:205) at com.nextcloud.utils.AutoRenameTests.setup(AutoRenameTests.kt:31)
Tests
| Test | emulator-5554 |
|---|---|
| testE2EEFile | failed (0.445s) |
| testEndInvalidExtension | failed (0.406s) |
| testEndInvalidFolderChar | failed (0.418s) |
| testEndNonPrintableChar | failed (0.413s) |
| testExtensionNonPrintableChar | failed (0.389s) |
| testFolderNameLowercase | failed (0.394s) |
| testInvalidChar | failed (0.388s) |
| testInvalidExtension | failed (0.422s) |
| testMiddleInvalidFolderChar | failed (0.380s) |
| testMiddleNonPrintableChar | failed (1.238s) |
| testMixedInvalidChar | failed (0.414s) |
| testMultipleInvalidChars | failed (0.419s) |
| testRemovingLeadingWhitespace | failed (0.430s) |
| testRemovingTrailingAndLeadingWhitespace | failed (0.538s) |
| testRemovingTrailingWhitespace | failed (0.423s) |
| testRenameExtensionForFile | failed (0.391s) |
| testRenameExtensionForFolder | failed (0.477s) |
| testRenameWithLowercasedFiles | failed (0.445s) |
| testStartEndInvalidExtensions | failed (0.450s) |
| testStartInvalidExtension | failed (0.431s) |
| testStartInvalidFolderChar | failed (0.389s) |
| testStartNonPrintableChar | failed (0.792s) |
| testStartsWithPathSeparator | failed (0.427s) |
| testStartsWithPathSeparatorAndValidFilepath | failed (0.695s) |
| testValidFilename | failed (0.435s) |
| testWCFDisabledOnNextcloud30to31ShouldStillApplyRestrictions | failed (0.426s) |
| testWCFDisabledOnNextcloud32ShouldSkipRestrictions | failed (0.413s) |
| testWCFEnabledOnNextcloud32ShouldApplyRestrictions | failed (0.431s) |
| testWCFOnNextcloudBelow30ShouldSkipRestrictions | failed (0.643s) |