Class com.owncloud.android.operations.DeleteE2ERemoteOperationIT

3

tests

3

failures

0

skipped

5.469s

duration

0%

successful

Failed tests

testDeleteEncryptedFiles

java.lang.AssertionError
	at org.junit.Assert.fail(Assert.java:87)
	at org.junit.Assert.assertTrue(Assert.java:42)
	at org.junit.Assert.assertTrue(Assert.java:53)
	at com.owncloud.android.operations.DeleteE2ERemoteOperationIT.testDeleteEncryptedFiles(DeleteE2ERemoteOperationIT.kt:29)

testDeletePrivateKey

java.lang.AssertionError
	at org.junit.Assert.fail(Assert.java:87)
	at org.junit.Assert.assertTrue(Assert.java:42)
	at org.junit.Assert.assertTrue(Assert.java:53)
	at com.owncloud.android.operations.DeleteE2ERemoteOperationIT.testDeletePrivateKey(DeleteE2ERemoteOperationIT.kt:48)

testDeletePublicKey

java.lang.AssertionError
	at org.junit.Assert.fail(Assert.java:87)
	at org.junit.Assert.assertTrue(Assert.java:42)
	at org.junit.Assert.assertTrue(Assert.java:53)
	at com.owncloud.android.operations.DeleteE2ERemoteOperationIT.testDeletePublicKey(DeleteE2ERemoteOperationIT.kt:58)

Tests

Test emulator-5554
testDeleteEncryptedFiles failed (0.836s)
testDeletePrivateKey failed (3.799s)
testDeletePublicKey failed (0.834s)