Class com.owncloud.android.EncryptedFoldersIT

5

tests

5

failures

0

skipped

4.451s

duration

0%

successful

Failed tests

testCreateEncryptedFolder

org.junit.AssumptionViolatedException: got: <false>, expected: is <true>
	at org.junit.Assume.assumeThat(Assume.java:106)
	at org.junit.Assume.assumeTrue(Assume.java:50)
	at com.owncloud.android.AbstractIT.testOnlyOnServer(AbstractIT.java:205)
	at com.owncloud.android.EncryptedFoldersIT.encryptionSetup(EncryptedFoldersIT.kt:127)

testCreateEncryptedSubfolder

org.junit.AssumptionViolatedException: got: <false>, expected: is <true>
	at org.junit.Assume.assumeThat(Assume.java:106)
	at org.junit.Assume.assumeTrue(Assume.java:50)
	at com.owncloud.android.AbstractIT.testOnlyOnServer(AbstractIT.java:205)
	at com.owncloud.android.EncryptedFoldersIT.encryptionSetup(EncryptedFoldersIT.kt:127)

testReadEncryptedFolder

org.junit.AssumptionViolatedException: got: <false>, expected: is <true>
	at org.junit.Assume.assumeThat(Assume.java:106)
	at org.junit.Assume.assumeTrue(Assume.java:50)
	at com.owncloud.android.AbstractIT.testOnlyOnServer(AbstractIT.java:205)
	at com.owncloud.android.EncryptedFoldersIT.encryptionSetup(EncryptedFoldersIT.kt:127)

testReadEncryptedSubfolder

org.junit.AssumptionViolatedException: got: <false>, expected: is <true>
	at org.junit.Assume.assumeThat(Assume.java:106)
	at org.junit.Assume.assumeTrue(Assume.java:50)
	at com.owncloud.android.AbstractIT.testOnlyOnServer(AbstractIT.java:205)
	at com.owncloud.android.EncryptedFoldersIT.encryptionSetup(EncryptedFoldersIT.kt:127)

testUnencryptFolder

org.junit.AssumptionViolatedException: got: <false>, expected: is <true>
	at org.junit.Assume.assumeThat(Assume.java:106)
	at org.junit.Assume.assumeTrue(Assume.java:50)
	at com.owncloud.android.AbstractIT.testOnlyOnServer(AbstractIT.java:205)
	at com.owncloud.android.EncryptedFoldersIT.encryptionSetup(EncryptedFoldersIT.kt:127)

Tests

Test emulator-5554
testCreateEncryptedFolder failed (1.041s)
testCreateEncryptedSubfolder failed (0.863s)
testReadEncryptedFolder failed (0.841s)
testReadEncryptedSubfolder failed (0.866s)
testUnencryptFolder failed (0.840s)