Class com.nextcloud.client.migrations.MigrationsManagerTest

5

tests

5

failures

0

skipped

10.509s

duration

0%

successful

Failed tests

applied_migrations_are_recorded

org.mockito.exceptions.base.MockitoException: 
Failed to release mocks

This should not happen unless you are using a third-party mock maker
	at com.nextcloud.client.migrations.MigrationsManagerTest.setUp(MigrationsManagerTest.kt:57)
	... 31 trimmed
Caused by: org.mockito.exceptions.base.MockitoException: 
Mockito cannot mock this class: interface com.nextcloud.client.appinfo.AppInfo.

Mockito can only mock non-private & non-final classes, but the root cause of this error might be different.
Please check the full stacktrace to understand what the issue is.
If you're still not sure why you're getting this error, please open an issue on GitHub.



IMPORTANT INFORMATION FOR ANDROID USERS:

The regular Byte Buddy mock makers cannot generate code on an Android VM!
To resolve this, please use the 'mockito-android' dependency for your application:
https://search.maven.org/artifact/org.mockito/mockito-android

Java               : 0.9
JVM vendor name    : The Android Project
JVM vendor version : 2.1.0
JVM name           : Dalvik
JVM version        : 0.9
JVM info           : null
OS name            : Linux
OS version         : 4.14.175-gdbec1739


Underlying exception : java.lang.IllegalStateException: Cannot invoke Android dex file translation method
	... 33 more
Caused by: java.lang.IllegalStateException: Cannot invoke Android dex file translation method
	at net.bytebuddy.android.AndroidClassLoadingStrategy$DexProcessor$ForSdkCompiler$Dispatcher$ForApi26LevelCompatibleVm.translate(AndroidClassLoadingStrategy.java:648)
	at net.bytebuddy.android.AndroidClassLoadingStrategy$DexProcessor$ForSdkCompiler$Conversion.register(AndroidClassLoadingStrategy.java:459)
	at net.bytebuddy.android.AndroidClassLoadingStrategy.load(AndroidClassLoadingStrategy.java:163)
	at net.bytebuddy.android.AndroidClassLoadingStrategy$Injecting.load(AndroidClassLoadingStrategy.java:760)
	at net.bytebuddy.dynamic.TypeResolutionStrategy$Passive.initialize(TypeResolutionStrategy.java:101)
	at net.bytebuddy.dynamic.DynamicType$Default$Unloaded.load(DynamicType.java:7725)
	at org.mockito.internal.creation.bytebuddy.SubclassBytecodeGenerator.mockClass(SubclassBytecodeGenerator.java:285)
	at org.mockito.internal.creation.bytebuddy.TypeCachingBytecodeGenerator.lambda$mockClass$0$org-mockito-internal-creation-bytebuddy-TypeCachingBytecodeGenerator(TypeCachingBytecodeGenerator.java:78)
	at org.mockito.internal.creation.bytebuddy.TypeCachingBytecodeGenerator$$ExternalSyntheticLambda0.call(D8$$SyntheticClass:0)
	at net.bytebuddy.TypeCache.findOrInsert(TypeCache.java:172)
	at net.bytebuddy.TypeCache$WithInlineExpunction.findOrInsert(TypeCache.java:403)
	at net.bytebuddy.TypeCache.findOrInsert(TypeCache.java:194)
	at net.bytebuddy.TypeCache$WithInlineExpunction.findOrInsert(TypeCache.java:414)
	at org.mockito.internal.creation.bytebuddy.TypeCachingBytecodeGenerator.mockClass(TypeCachingBytecodeGenerator.java:75)
	at org.mockito.internal.creation.bytebuddy.SubclassByteBuddyMockMaker.createMockType(SubclassByteBuddyMockMaker.java:79)
	at org.mockito.internal.creation.bytebuddy.SubclassByteBuddyMockMaker.createMock(SubclassByteBuddyMockMaker.java:45)
	at org.mockito.android.internal.creation.AndroidByteBuddyMockMaker.createMock(AndroidByteBuddyMockMaker.java:40)
	at org.mockito.internal.util.MockUtil.createMock(MockUtil.java:99)
	at org.mockito.internal.MockitoCore.mock(MockitoCore.java:80)
	at org.mockito.Mockito.mock(Mockito.java:2235)
	at org.mockito.internal.configuration.MockAnnotationProcessor.processAnnotationForMock(MockAnnotationProcessor.java:79)
	at org.mockito.internal.configuration.MockAnnotationProcessor.process(MockAnnotationProcessor.java:28)
	at org.mockito.internal.configuration.MockAnnotationProcessor.process(MockAnnotationProcessor.java:25)
	at org.mockito.internal.configuration.IndependentAnnotationEngine.createMockFor(IndependentAnnotationEngine.java:44)
	at org.mockito.internal.configuration.IndependentAnnotationEngine.process(IndependentAnnotationEngine.java:72)
	at org.mockito.internal.configuration.InjectingAnnotationEngine.processIndependentAnnotations(InjectingAnnotationEngine.java:62)
	at org.mockito.internal.configuration.InjectingAnnotationEngine.process(InjectingAnnotationEngine.java:47)
	at org.mockito.MockitoAnnotations.openMocks(MockitoAnnotations.java:81)
	at org.mockito.MockitoAnnotations.initMocks(MockitoAnnotations.java:99)
	... 33 more
Caused by: java.lang.OutOfMemoryError: OutOfMemoryError thrown while trying to throw an exception; no stack trace available

new_app_version_is_marked_as_migrated_if_no_new_migrations_are_available

org.mockito.exceptions.base.MockitoException: 
Failed to release mocks

This should not happen unless you are using a third-party mock maker
	at com.nextcloud.client.migrations.MigrationsManagerTest.setUp(MigrationsManagerTest.kt:57)
	... 31 trimmed
Caused by: org.mockito.exceptions.base.MockitoException: 
Mockito cannot mock this class: interface com.nextcloud.client.appinfo.AppInfo.

Mockito can only mock non-private & non-final classes, but the root cause of this error might be different.
Please check the full stacktrace to understand what the issue is.
If you're still not sure why you're getting this error, please open an issue on GitHub.



IMPORTANT INFORMATION FOR ANDROID USERS:

The regular Byte Buddy mock makers cannot generate code on an Android VM!
To resolve this, please use the 'mockito-android' dependency for your application:
https://search.maven.org/artifact/org.mockito/mockito-android

Java               : 0.9
JVM vendor name    : The Android Project
JVM vendor version : 2.1.0
JVM name           : Dalvik
JVM version        : 0.9
JVM info           : null
OS name            : Linux
OS version         : 4.14.175-gdbec1739


Underlying exception : java.lang.IllegalStateException: Cannot invoke Android dex file translation method
	... 33 more
Caused by: java.lang.IllegalStateException: Cannot invoke Android dex file translation method
	at net.bytebuddy.android.AndroidClassLoadingStrategy$DexProcessor$ForSdkCompiler$Dispatcher$ForApi26LevelCompatibleVm.translate(AndroidClassLoadingStrategy.java:648)
	at net.bytebuddy.android.AndroidClassLoadingStrategy$DexProcessor$ForSdkCompiler$Conversion.register(AndroidClassLoadingStrategy.java:459)
	at net.bytebuddy.android.AndroidClassLoadingStrategy.load(AndroidClassLoadingStrategy.java:163)
	at net.bytebuddy.android.AndroidClassLoadingStrategy$Injecting.load(AndroidClassLoadingStrategy.java:760)
	at net.bytebuddy.dynamic.TypeResolutionStrategy$Passive.initialize(TypeResolutionStrategy.java:101)
	at net.bytebuddy.dynamic.DynamicType$Default$Unloaded.load(DynamicType.java:7725)
	at org.mockito.internal.creation.bytebuddy.SubclassBytecodeGenerator.mockClass(SubclassBytecodeGenerator.java:285)
	at org.mockito.internal.creation.bytebuddy.TypeCachingBytecodeGenerator.lambda$mockClass$0$org-mockito-internal-creation-bytebuddy-TypeCachingBytecodeGenerator(TypeCachingBytecodeGenerator.java:78)
	at org.mockito.internal.creation.bytebuddy.TypeCachingBytecodeGenerator$$ExternalSyntheticLambda0.call(D8$$SyntheticClass:0)
	at net.bytebuddy.TypeCache.findOrInsert(TypeCache.java:172)
	at net.bytebuddy.TypeCache$WithInlineExpunction.findOrInsert(TypeCache.java:403)
	at net.bytebuddy.TypeCache.findOrInsert(TypeCache.java:194)
	at net.bytebuddy.TypeCache$WithInlineExpunction.findOrInsert(TypeCache.java:414)
	at org.mockito.internal.creation.bytebuddy.TypeCachingBytecodeGenerator.mockClass(TypeCachingBytecodeGenerator.java:75)
	at org.mockito.internal.creation.bytebuddy.SubclassByteBuddyMockMaker.createMockType(SubclassByteBuddyMockMaker.java:79)
	at org.mockito.internal.creation.bytebuddy.SubclassByteBuddyMockMaker.createMock(SubclassByteBuddyMockMaker.java:45)
	at org.mockito.android.internal.creation.AndroidByteBuddyMockMaker.createMock(AndroidByteBuddyMockMaker.java:40)
	at org.mockito.internal.util.MockUtil.createMock(MockUtil.java:99)
	at org.mockito.internal.MockitoCore.mock(MockitoCore.java:80)
	at org.mockito.Mockito.mock(Mockito.java:2235)
	at org.mockito.internal.configuration.MockAnnotationProcessor.processAnnotationForMock(MockAnnotationProcessor.java:79)
	at org.mockito.internal.configuration.MockAnnotationProcessor.process(MockAnnotationProcessor.java:28)
	at org.mockito.internal.configuration.MockAnnotationProcessor.process(MockAnnotationProcessor.java:25)
	at org.mockito.internal.configuration.IndependentAnnotationEngine.createMockFor(IndependentAnnotationEngine.java:44)
	at org.mockito.internal.configuration.IndependentAnnotationEngine.process(IndependentAnnotationEngine.java:72)
	at org.mockito.internal.configuration.InjectingAnnotationEngine.processIndependentAnnotations(InjectingAnnotationEngine.java:62)
	at org.mockito.internal.configuration.InjectingAnnotationEngine.process(InjectingAnnotationEngine.java:47)
	at org.mockito.MockitoAnnotations.openMocks(MockitoAnnotations.java:81)
	at org.mockito.MockitoAnnotations.initMocks(MockitoAnnotations.java:99)
	... 33 more
Caused by: java.lang.OutOfMemoryError: OutOfMemoryError thrown while trying to throw an exception; no stack trace available

null

java.lang.OutOfMemoryError: Failed to allocate a 6808 byte allocation with 1848 free bytes and 1848B until OOM, target footprint 16777216, growth limit 16777216
	at java.lang.StringFactory.newStringFromChars(StringFactory.java:260)
	at java.lang.StringBuffer.toString(StringBuffer.java:671)
	at java.io.StringWriter.toString(StringWriter.java:210)
	at androidx.test.services.events.internal.Throwables.getFullStackTrace(Throwables.java:134)
	at androidx.test.services.events.internal.Throwables.getCauseStackTraceLines(Throwables.java:106)
	at androidx.test.services.events.internal.Throwables.getTrimmedStackTrace(Throwables.java:55)
	at androidx.test.services.events.internal.StackTrimmer.getTrimmedStackTrace(StackTrimmer.java:37)
	at androidx.test.internal.runner.listener.InstrumentationResultPrinter.reportFailure(InstrumentationResultPrinter.java:188)
	at androidx.test.internal.runner.listener.InstrumentationResultPrinter.lambda$testFailure$0$androidx-test-internal-runner-listener-InstrumentationResultPrinter(InstrumentationResultPrinter.java:159)
	at androidx.test.internal.runner.listener.InstrumentationResultPrinter$$ExternalSyntheticLambda0.run(D8$$SyntheticClass:0)
	at androidx.test.internal.runner.listener.InstrumentationResultPrinter.handleFailure(InstrumentationResultPrinter.java:171)
	at androidx.test.internal.runner.listener.InstrumentationResultPrinter.testFailure(InstrumentationResultPrinter.java:155)
	at org.junit.runner.notification.SynchronizedRunListener.testFailure(SynchronizedRunListener.java:94)
	at org.junit.runner.notification.RunNotifier$6.notifyListener(RunNotifier.java:177)
	at org.junit.runner.notification.RunNotifier$SafeNotifier.run(RunNotifier.java:72)
	at org.junit.runner.notification.RunNotifier.fireTestFailures(RunNotifier.java:173)
	at org.junit.runner.notification.RunNotifier.fireTestFailure(RunNotifier.java:167)
	at org.junit.internal.runners.model.EachTestNotifier.addFailure(EachTestNotifier.java:23)
	at org.junit.runners.ParentRunner.runLeaf(ParentRunner.java:370)
	at org.junit.runners.BlockJUnit4ClassRunner.runChild(BlockJUnit4ClassRunner.java:103)
	at org.junit.runners.BlockJUnit4ClassRunner.runChild(BlockJUnit4ClassRunner.java:63)
	at org.junit.runners.ParentRunner$4.run(ParentRunner.java:331)
	at org.junit.runners.ParentRunner$1.schedule(ParentRunner.java:79)
	at org.junit.runners.ParentRunner.runChildren(ParentRunner.java:329)
	at org.junit.runners.ParentRunner.access$100(ParentRunner.java:66)
	at org.junit.runners.ParentRunner$2.evaluate(ParentRunner.java:293)
	at org.junit.runners.ParentRunner$3.evaluate(ParentRunner.java:306)
	at org.junit.runners.ParentRunner.run(ParentRunner.java:413)
	at org.junit.runners.Suite.runChild(Suite.java:128)
	at org.junit.runners.Suite.runChild(Suite.java:27)
	at org.junit.runners.ParentRunner$4.run(ParentRunner.java:331)
	at org.junit.runners.ParentRunner$1.schedule(ParentRunner.java:79)
	at org.junit.runners.ParentRunner.runChildren(ParentRunner.java:329)
	at org.junit.runners.ParentRunner.access$100(ParentRunner.java:66)
	at org.junit.runners.ParentRunner$2.evaluate(ParentRunner.java:293)
	at org.junit.runners.ParentRunner$3.evaluate(ParentRunner.java:306)
	at org.junit.runners.ParentRunner.run(ParentRunner.java:413)
	at org.junit.runner.JUnitCore.run(JUnitCore.java:137)
	at org.junit.runner.JUnitCore.run(JUnitCore.java:115)
	at androidx.test.internal.runner.TestExecutor.execute(TestExecutor.java:68)
	at androidx.test.internal.runner.TestExecutor.execute(TestExecutor.java:59)
	at androidx.test.runner.AndroidJUnitRunner.onStart(AndroidJUnitRunner.java:467)
	at android.app.Instrumentation$InstrumentationThread.run(Instrumentation.java:2189)

optional_migration_failure_does_not_trigger_a_migration_failure

org.mockito.exceptions.base.MockitoException: 
Failed to release mocks

This should not happen unless you are using a third-party mock maker
	at com.nextcloud.client.migrations.MigrationsManagerTest.setUp(MigrationsManagerTest.kt:57)
	... 31 trimmed
Caused by: org.mockito.exceptions.base.MockitoException: 
Mockito cannot mock this class: interface com.nextcloud.client.appinfo.AppInfo.

Mockito can only mock non-private & non-final classes, but the root cause of this error might be different.
Please check the full stacktrace to understand what the issue is.
If you're still not sure why you're getting this error, please open an issue on GitHub.



IMPORTANT INFORMATION FOR ANDROID USERS:

The regular Byte Buddy mock makers cannot generate code on an Android VM!
To resolve this, please use the 'mockito-android' dependency for your application:
https://search.maven.org/artifact/org.mockito/mockito-android

Java               : 0.9
JVM vendor name    : The Android Project
JVM vendor version : 2.1.0
JVM name           : Dalvik
JVM version        : 0.9
JVM info           : null
OS name            : Linux
OS version         : 4.14.175-gdbec1739


Underlying exception : java.lang.IllegalStateException: Cannot invoke Android dex file translation method
	... 33 more
Caused by: java.lang.IllegalStateException: Cannot invoke Android dex file translation method
	at net.bytebuddy.android.AndroidClassLoadingStrategy$DexProcessor$ForSdkCompiler$Dispatcher$ForApi26LevelCompatibleVm.translate(AndroidClassLoadingStrategy.java:648)
	at net.bytebuddy.android.AndroidClassLoadingStrategy$DexProcessor$ForSdkCompiler$Conversion.register(AndroidClassLoadingStrategy.java:459)
	at net.bytebuddy.android.AndroidClassLoadingStrategy.load(AndroidClassLoadingStrategy.java:163)
	at net.bytebuddy.android.AndroidClassLoadingStrategy$Injecting.load(AndroidClassLoadingStrategy.java:760)
	at net.bytebuddy.dynamic.TypeResolutionStrategy$Passive.initialize(TypeResolutionStrategy.java:101)
	at net.bytebuddy.dynamic.DynamicType$Default$Unloaded.load(DynamicType.java:7725)
	at org.mockito.internal.creation.bytebuddy.SubclassBytecodeGenerator.mockClass(SubclassBytecodeGenerator.java:285)
	at org.mockito.internal.creation.bytebuddy.TypeCachingBytecodeGenerator.lambda$mockClass$0$org-mockito-internal-creation-bytebuddy-TypeCachingBytecodeGenerator(TypeCachingBytecodeGenerator.java:78)
	at org.mockito.internal.creation.bytebuddy.TypeCachingBytecodeGenerator$$ExternalSyntheticLambda0.call(D8$$SyntheticClass:0)
	at net.bytebuddy.TypeCache.findOrInsert(TypeCache.java:172)
	at net.bytebuddy.TypeCache$WithInlineExpunction.findOrInsert(TypeCache.java:403)
	at net.bytebuddy.TypeCache.findOrInsert(TypeCache.java:194)
	at net.bytebuddy.TypeCache$WithInlineExpunction.findOrInsert(TypeCache.java:414)
	at org.mockito.internal.creation.bytebuddy.TypeCachingBytecodeGenerator.mockClass(TypeCachingBytecodeGenerator.java:75)
	at org.mockito.internal.creation.bytebuddy.SubclassByteBuddyMockMaker.createMockType(SubclassByteBuddyMockMaker.java:79)
	at org.mockito.internal.creation.bytebuddy.SubclassByteBuddyMockMaker.createMock(SubclassByteBuddyMockMaker.java:45)
	at org.mockito.android.internal.creation.AndroidByteBuddyMockMaker.createMock(AndroidByteBuddyMockMaker.java:40)
	at org.mockito.internal.util.MockUtil.createMock(MockUtil.java:99)
	at org.mockito.internal.MockitoCore.mock(MockitoCore.java:80)
	at org.mockito.Mockito.mock(Mockito.java:2235)
	at org.mockito.internal.configuration.MockAnnotationProcessor.processAnnotationForMock(MockAnnotationProcessor.java:79)
	at org.mockito.internal.configuration.MockAnnotationProcessor.process(MockAnnotationProcessor.java:28)
	at org.mockito.internal.configuration.MockAnnotationProcessor.process(MockAnnotationProcessor.java:25)
	at org.mockito.internal.configuration.IndependentAnnotationEngine.createMockFor(IndependentAnnotationEngine.java:44)
	at org.mockito.internal.configuration.IndependentAnnotationEngine.process(IndependentAnnotationEngine.java:72)
	at org.mockito.internal.configuration.InjectingAnnotationEngine.processIndependentAnnotations(InjectingAnnotationEngine.java:62)
	at org.mockito.internal.configuration.InjectingAnnotationEngine.process(InjectingAnnotationEngine.java:47)
	at org.mockito.MockitoAnnotations.openMocks(MockitoAnnotations.java:81)
	at org.mockito.MockitoAnnotations.initMocks(MockitoAnnotations.java:99)
	... 33 more
Caused by: java.lang.OutOfMemoryError: OutOfMemoryError thrown while trying to throw OutOfMemoryError; no stack trace available

previously_run_migrations_are_not_run_again


Tests

Test emulator-5554
applied_migrations_are_recorded failed (1.449s)
new_app_version_is_marked_as_migrated_if_no_new_migrations_are_available failed (2.688s)
null failed (0.114s)
optional_migration_failure_does_not_trigger_a_migration_failure failed (1.516s)
previously_run_migrations_are_not_run_again failed (4.742s)